program: Gaussian 09
title: 000190781
version: EM64L-G09RevD.01
frameworkgroup: C1[X(C16H22O6)]
method: RPBEPBE
basis: SDD
operation: Freq
keyword: #pfreq=noraman
keyword: PBEPBE/SDD
title: #p freq=noraman PBEPBE/SDD
converged: NO YES NO NO
title: Mulliken charges:
elementType: O O O O O O C C C C C C C C C C C C C C C C H H H H H H H H H H H H H H H H H H H H H H
charge: -0.462367 -0.346215 -0.256090 -0.235046 -0.427575 -0.224508 0.182896 -0.277134 -0.170266 -0.247137 -0.500477 -0.394035 0.382953 -0.590823 0.129745 -0.408208 0.333938 -0.520830 -0.832760 0.215086 -0.485102 -0.486796 0.260959 0.283095 0.281001 0.243970 0.240707 0.251305 0.239600 0.252481 0.249868 0.217118 0.273155 0.231156 0.225083 0.227979 0.375152 0.218684 0.238125 0.220874 0.227588 0.232261 0.253163 0.377431
chargesum: 0.00000
title: Mulliken charges with hydrogens summed into heavy atoms:
elementType: O O O O O O C C C C C C C C C C C C C C C C
charge: -0.087215 -0.346215 -0.256090 -0.235046 -0.050144 -0.224508 0.182896 -0.016175 0.112829 0.033863 -0.015800 0.096870 0.382953 -0.088475 0.129745 -0.191091 0.333938 -0.247675 -0.148542 0.215086 0.192582 0.226215
polarizability: 1.95759555e+02 -1.49529970e+01 2.18753159e+02 2.94957931e+00 1.84090780e+01 1.52968600e+02
1716.lowfreq: -5.5637 -0.0007 -0.0006 -0.0003 8.9149 12.6307 39.9877 49.6449 55.1641
frequency: 39.9455 49.6274 55.1223 68.9579 77.3601 88.3385 89.1608 91.7272 128.0781 139.5734 153.0858 159.6990 173.9405 181.0141 188.7904 220.4936 232.1263 249.6862 255.6304 277.3246 296.0317 307.0110 322.6651 337.8143 362.9622 391.4253 406.8805 412.9188 425.9011 453.7470 488.0588 492.4447 548.2427 573.8544 593.6456 606.2178 613.7641 632.3414 673.9364 683.8014 699.6041 740.9864 781.5662 802.8680 818.8172 837.7930 862.2842 876.0808 890.0514 896.6218 931.8463 944.3486 957.3188 966.0229 977.0229 1005.4840 1024.3286 1042.6855 1049.8624 1051.4391 1053.7156 1067.0624 1106.6748 1109.1893 1119.9464 1138.7938 1141.6275 1151.0889 1162.6484 1165.8753 1178.9640 1202.6774 1207.2186 1229.9073 1259.0766 1262.1565 1271.5158 1286.1290 1293.4010 1301.7985 1317.4767 1320.9712 1332.9039 1341.3439 1345.9088 1357.8278 1377.0230 1404.2129 1432.8910 1438.4254 1452.0180 1453.2779 1458.3961 1459.6640 1461.0590 1465.2660 1468.3467 1470.4367 1471.8165 1490.2483 1559.9730 1605.0155 1667.8314 1695.3571 2942.0626 2952.8044 2963.0249 2969.6062 2973.5066 2991.2625 2994.9811 3007.0633 3019.5474 3029.2977 3032.1082 3033.3901 3039.8310 3079.2740 3084.2863 3096.7586 3117.0710 3117.4552 3140.7220 3163.0822 3168.0998 3512.3415
redmass: 5.8196 4.0257 4.7610 5.6942 6.1366 2.8197 3.7412 2.6803 2.2953 2.8115 1.2068 2.0696 2.6818 4.0169 1.9622 2.4432 3.8010 2.8955 3.2025 2.6666 4.5426 3.8425 4.1044 3.8156 5.5152 4.6828 3.6538 3.2082 3.8746 4.7857 3.7320 3.3021 3.5290 3.1020 2.9928 2.7844 3.0009 4.8773 2.8795 3.2535 3.9304 1.1097 2.7685 2.4659 1.7241 3.8746 3.5247 1.5442 4.0341 4.1518 1.9460 2.7632 2.3148 3.6421 2.4938 2.7224 3.7327 2.8016 3.0278 2.2340 1.8488 2.2877 1.2379 2.7912 1.4558 1.5872 1.5120 1.9947 1.6756 1.6342 1.9312 1.8382 1.5222 1.3707 1.3275 1.5254 1.2960 2.0226 1.5664 1.4479 1.6545 2.2884 1.3882 1.7537 1.6960 1.6775 1.3015 1.2260 1.1450 1.1624 1.0561 1.0744 1.0731 1.0588 1.0727 1.0810 1.0681 1.0702 1.0658 1.0934 10.9154 7.8604 8.5418 6.7865 1.0809 1.0328 1.0377 1.0585 1.0648 1.0806 1.0823 1.0292 1.0615 1.0933 1.0965 1.1043 1.1044 1.0987 1.0995 1.0904 1.1001 1.1042 1.1054 1.0913 1.0682 1.0637
irintensity: 2.4223 1.1863 2.3973 1.4866 1.3799 1.4602 4.0432 2.6569 3.5692 1.0752 0.9987 1.2883 4.8668 2.4402 1.1651 2.2889 9.2306 2.6273 0.5329 3.4694 4.1256 0.2738 0.8560 3.4656 5.3524 5.5711 2.6695 17.3387 5.5839 2.0909 5.6799 8.9353 24.8423 11.6807 24.7963 41.1776 54.1487 4.1966 43.4098 28.3962 1.4556 68.0512 31.5545 3.1667 18.3725 11.1547 2.0439 33.2059 9.9089 21.9408 10.7313 30.3577 9.4224 13.3383 5.2622 36.5616 25.8933 57.7443 49.7737 64.2694 131.7338 53.4712 1.1395 10.3328 13.9912 28.7424 0.7237 4.0000 14.6694 4.1677 70.2093 128.2453 82.1864 1.3180 0.1778 20.7607 5.1307 24.1818 19.7843 34.4245 17.5749 107.5105 3.4127 17.7262 19.5568 25.7518 0.4996 14.9559 4.0428 6.0764 31.7632 1.7071 15.4548 1.5388 15.0394 27.4963 44.6975 7.4092 24.8761 23.3302 94.4417 376.2592 208.7940 3.0463 11.6626 82.6743 34.1442 8.6296 35.1517 20.9257 3.8549 57.2837 10.0959 18.4995 20.6303 40.3900 28.5552 19.9259 12.8239 45.3597 17.4675 31.1935 30.7393 6.8374 374.6425 21.9123
temp: 298.150 k
press: 1.00000 atm
elementType: 8 8 8 8 8 8 6 6 6 6 6 6 6 6 6 6 6 6 6 6 6 6 1 1 1 1 1 1 1 1 1 1 1 1 1 1 1 1 1 1 1 1 1 1
symmnumber: 1
zpe: 937185.1 jmol-1
zpe.correction: 0.356955 hartree
zpe.thermalcorrener: 0.379731 hartree
zpe.thermalcorrenthalpy: 0.380675 hartree
zpe.thermalcorrgfe: 0.305720 hartree
zpe.sumelectzpe: -1072.498775 hartree
zpe.sumelectthermal: -1072.475999 hartree
zpe.sumelectthermalent: -1072.475054 hartree
zpe.sumelectthermalfe: -1072.550010 hartree
dipole: 0.7996 2.0490 2.3424
dipole: 3.2132
quadrupole: -127.9245 -146.3947 -120.4044
quadrupole: -18.9542 -4.2376 -14.3399
quadrupole: 3.6500 -14.8202 11.1701 -18.9542 -4.2376 -14.3399
hfenergy: -1072.8557295 hartree
pointgroup: C01 [X(C16H22O6)]
dipole: -0.5142027 0.8194781 -0.8137139 debye
polarizability: 185.8387217|-0.2870534|229.1960415|14.116414|2.3447079|152.4465513 unknown
InChI: InChI=1S/C16H22O6/c1-9-4-5-10-12(17)7-13(22-3)15(20)16(10,8-21-2)11(9)6-14(18)19/h4,7,10-11,15,18,20H,5-6,8H2,1-3H3
charge 0 multiplicity 1
44 atoms
O  0.478017 2.112066 -0.270709
O  0.326657 0.612032 -2.388449
O  3.143379 1.766247 0.848841
O  2.538945 -2.933136 0.969936
O  -1.504544 2.550415 2.162024
O  -2.808712 2.598355 0.241452
C  0.096775 -0.36012 -0.123822
C  0.487544 -1.608038 0.733935
C  -1.467351 -0.191841 -0.165806
C  0.773161 0.907682 0.507708
C  -0.172803 -2.917844 0.246581
C  0.605469 -0.593663 -1.575063
C  -2.171507 -1.515439 -0.483936
C  -2.079392 0.42242 1.142831
C  2.022139 -1.774208 0.855835
C  -1.579836 -2.722368 -0.268964
C  2.276383 0.696762 0.735942
C  2.827174 -0.55843 0.885102
C  -3.565312 -1.398176 -1.071717
C  -2.176628 1.936564 1.091403
C  0.79398 0.49311 -3.770843
C  2.665602 3.152877 1.070694
H  0.122573 -1.402385 1.764883
H  -1.706974 0.519306 -0.981609
H  0.32294 1.088449 1.503858
H  -0.160222 -3.653542 1.072192
H  0.457661 -3.385277 -0.537989
H  0.076269 -1.453906 -2.027507
H  1.696506 -0.789382 -1.587779
H  -3.117259 0.055549 1.243049
H  -1.536002 0.096382 2.044579
H  -2.135658 -3.637292 -0.520745
H  3.900198 -0.662302 1.074447
H  -3.535936 -0.889305 -2.055571
H  -4.239145 -0.791962 -0.434684
H  -4.032216 -2.388693 -1.209387
H  0.450057 1.826077 -1.241205
H  1.892561 0.348762 -3.809827
H  0.52214 1.433398 -4.274343
H  0.293341 -0.356942 -4.274797
H  3.53328 3.660985 1.519773
H  1.803478 3.174922 1.758031
H  2.37308 3.613722 0.11674
H  -1.575712 3.53807 2.055919
