program: Gaussian 09
title: 000190772
version: EM64L-G09RevD.01
frameworkgroup: C1[X(C16H20O6)]
method: RPBEPBE
basis: SDD
operation: Freq
keyword: #pfreq=noraman
keyword: PBEPBE/SDD
title: #p freq=noraman PBEPBE/SDD
converged: YES YES NO NO
title: Mulliken charges:
elementType: O O O O O O C C C C C C C C C C C C C C C C H H H H H H H H H H H H H H H H H H H H
charge: -0.286247 -0.182688 -0.212075 -0.246643 -0.412976 -0.231959 0.155909 -0.265338 -0.197022 -0.470264 -0.390068 0.408387 0.043319 -0.570995 -0.421155 0.103376 0.253862 -0.453022 -0.832298 0.159202 -0.499339 -0.512635 0.283071 0.288876 0.247043 0.234272 0.244738 0.226058 0.266672 0.297077 0.218095 0.278570 0.223285 0.232951 0.236253 0.215331 0.209990 0.236087 0.377346 0.233073 0.261521 0.250359
chargesum: 0.00000
title: Mulliken charges with hydrogens summed into heavy atoms:
elementType: O O O O O O C C C C C C C C C C C C C C C C
charge: -0.286247 -0.182688 -0.212075 -0.246643 -0.035630 -0.231959 0.155909 0.017734 0.091854 0.011051 0.080728 0.408387 0.043319 -0.007246 -0.203060 0.103376 0.253862 -0.174452 -0.139809 0.159202 0.162069 0.232319
polarizability: 1.95272342e+02 5.55984669e+00 2.18240384e+02 -7.58498457e+00 -1.34600278e+01 1.57618461e+02
1716.lowfreq: -9.8149 -5.2285 -0.0008 -0.0005 -0.0004 8.4069 12.5021 36.2215 42.1564
frequency: 10.2957 36.1486 42.1505 53.0493 57.8229 65.5321 91.9183 101.7390 110.3200 153.1245 158.7933 163.3293 176.0800 181.3460 189.4982 201.9429 223.6486 243.7774 255.2908 268.9833 289.3874 300.1879 305.5489 329.3988 362.6470 391.9061 395.5140 416.7975 438.4775 448.4225 484.9175 491.3833 550.0575 566.6266 602.1596 614.3184 637.3507 638.9468 647.2917 686.9808 746.0043 753.6469 790.0155 817.4724 847.3411 866.9508 886.2941 891.2481 910.5570 919.0703 950.1252 967.2252 985.5370 998.4592 1029.1433 1039.8950 1047.3540 1056.4251 1057.8104 1065.3996 1101.0176 1109.2746 1115.8590 1140.3031 1148.0613 1153.9243 1165.8662 1166.9638 1180.0804 1202.2885 1208.5941 1243.1272 1251.2891 1253.3794 1280.3054 1290.7319 1297.2462 1299.5456 1323.3224 1339.8411 1348.4284 1363.7175 1366.6575 1402.4637 1420.9548 1432.9339 1436.5915 1455.4123 1458.8810 1459.9644 1462.0539 1466.2491 1467.9056 1468.9205 1483.7078 1553.9936 1587.0463 1592.9620 1666.5970 1686.5852 2937.6028 2946.3510 2958.7318 2970.8966 2972.3735 3003.1594 3008.6553 3013.7518 3016.2473 3018.9460 3031.9613 3044.8794 3069.8959 3080.2056 3100.4036 3110.3274 3124.6744 3144.2173 3157.7975 3511.6887
redmass: 5.5907 5.1425 3.9399 5.6154 8.2341 3.8134 3.5740 2.6311 3.2299 2.7858 3.3044 1.8865 1.9746 1.8206 2.6818 1.5975 2.5111 3.9207 2.6961 3.0649 2.9481 4.0314 2.9500 4.5440 5.5846 5.4221 3.8902 4.3838 3.3515 4.8365 2.4898 5.6900 4.1722 4.4453 3.5702 4.6201 1.6185 3.1291 4.3890 3.3446 3.8984 6.4524 3.3986 1.3788 4.0442 3.8765 4.7175 1.5043 3.1989 2.3302 2.4644 2.2718 2.1690 2.5327 2.8985 2.2306 1.6452 2.8067 5.9064 2.8370 3.0452 1.2368 1.2904 1.9195 1.7499 1.4813 1.5939 2.2999 1.6956 1.1933 1.8381 1.3647 1.7978 1.5838 1.9263 1.4347 1.7390 1.6747 2.4118 1.9071 1.8420 1.4221 1.5390 1.2281 1.0945 1.1921 1.1414 1.0581 1.0516 1.0521 1.0815 1.0588 1.0605 1.0593 1.0685 11.3435 9.5000 8.3266 8.0736 6.7402 1.0363 1.0550 1.0798 1.0373 1.0673 1.0809 1.0289 1.1011 1.0641 1.1039 1.0927 1.0959 1.0990 1.0998 1.0903 1.0985 1.1045 1.1066 1.0915 1.0639
irintensity: 0.3531 0.6062 0.6152 4.5901 2.2908 0.3924 3.5850 4.6155 4.3397 5.8754 0.0304 1.4775 2.8598 0.3018 6.0427 1.9624 2.5029 1.4007 5.0958 0.7374 1.2621 13.5461 1.4457 0.6587 10.8042 6.6000 3.6815 10.0563 15.6157 1.7165 13.4725 8.9658 24.2199 17.1159 14.7811 1.5257 118.2774 15.8009 0.6709 2.0088 3.2669 0.6992 2.9532 29.1426 27.7352 8.4060 17.6431 14.3551 14.0227 14.2295 8.5291 6.4720 60.9125 15.7308 105.6187 9.1920 57.7298 58.2176 158.0743 96.4476 27.6930 0.7046 3.7859 18.4387 9.0812 8.7495 13.4702 1.2023 84.6304 7.8800 147.9582 9.8918 1.2557 5.7000 10.2664 16.7603 14.1871 38.2705 79.1445 15.5697 9.9592 15.3356 30.1047 14.5006 18.0114 12.4024 2.3702 23.1227 13.0466 11.5215 14.8357 10.0239 16.0083 33.3503 2.6140 93.6426 360.1147 78.6016 184.7208 1.9093 67.6926 35.2326 5.0980 27.9725 27.0748 0.1996 44.1027 59.5669 12.7793 22.3301 13.4049 20.6808 2.3496 23.0654 39.8711 20.8204 19.5709 16.0024 2.2674 25.4560
temp: 298.150 k
press: 1.00000 atm
elementType: 8 8 8 8 8 8 6 6 6 6 6 6 6 6 6 6 6 6 6 6 6 6 1 1 1 1 1 1 1 1 1 1 1 1 1 1 1 1 1 1 1 1
symmnumber: 1
zpe: 873781.7 jmol-1
zpe.correction: 0.332806 hartree
zpe.thermalcorrener: 0.355710 hartree
zpe.thermalcorrenthalpy: 0.356654 hartree
zpe.thermalcorrgfe: 0.279134 hartree
zpe.sumelectzpe: -1071.321251 hartree
zpe.sumelectthermal: -1071.298347 hartree
zpe.sumelectthermalent: -1071.297403 hartree
zpe.sumelectthermalfe: -1071.374922 hartree
dipole: -0.3882 -0.9731 2.8720
dipole: 3.0571
quadrupole: -126.4912 -135.2819 -124.3652
quadrupole: -13.5005 13.4459 8.0399
quadrupole: 2.2215 -6.5691 4.3476 -13.5005 13.4459 8.0399
hfenergy: -1071.6540567 hartree
pointgroup: C01 [X(C16H20O6)]
dipole: -0.2411742 0.1257553 -1.1716154 debye
polarizability: 195.8898099|-4.9924716|209.5800144|4.8825161|-25.5455457|165.6613621 unknown
InChI: InChI=1S/C16H20O6/c1-9-4-5-10-12(17)7-13(22-3)15(20)16(10,8-21-2)11(9)6-14(18)19/h4,7,10-11,18H,5-6,8H2,1-3H3
charge 0 multiplicity 1
42 atoms
O  0.847549 0.117036 -2.17949
O  0.547919 2.114771 0.186518
O  2.334745 -2.599843 2.127724
O  3.424447 1.635923 0.274878
O  -3.685731 2.306206 1.922768
O  -3.401335 2.082898 -0.368373
C  0.148046 -0.331871 0.110801
C  0.421591 -1.316174 1.296714
C  -1.382787 -0.026016 0.025424
C  -0.313396 -2.663366 1.090206
C  0.637071 -0.978352 -1.224211
C  -2.185256 -1.335163 -0.034121
C  1.002172 0.940836 0.273624
C  -1.920113 0.846855 1.20264
C  -1.68694 -2.497242 0.474792
C  1.920362 -1.525948 1.584433
C  2.461673 0.695944 0.56342
C  2.853504 -0.455186 1.219913
C  -3.571664 -1.262554 -0.644546
C  -3.048567 1.771497 0.789694
C  1.1516 -0.368709 -3.526576
C  3.152888 2.717348 -0.711676
H  0.007336 -0.83491 2.208808
H  -1.553596 0.552268 -0.904285
H  -0.383952 -3.185197 2.062655
H  0.306303 -3.335848 0.461111
H  -0.124454 -1.68482 -1.60907
H  1.591961 -1.524024 -1.066599
H  -2.271666 0.226341 2.046497
H  -1.131687 1.511379 1.598355
H  -2.304077 -3.405602 0.422582
H  3.908414 -0.602751 1.475733
H  -4.040642 -2.260723 -0.696071
H  -3.537095 -0.833194 -1.663885
H  -4.24407 -0.603546 -0.062459
H  0.322805 -0.993732 -3.918579
H  2.090015 -0.961243 -3.542872
H  1.267068 0.52489 -4.159212
H  -4.388835 2.946033 1.625984
H  4.154602 3.070714 -0.997975
H  2.562998 3.518005 -0.242274
H  2.609191 2.314974 -1.582999
