program: Gaussian 09
title: 000190744
version: EM64L-G09RevD.01
frameworkgroup: C1[X(C9H6N2O2S)]
method: RPBEPBE
basis: SDD
operation: Freq
keyword: #p
keyword: freq=noraman
keyword: PBEPBE/SDD
title: #p freq=noraman PBEPBE/SDD
converged: NO YES NO YES
title: Mulliken charges:
elementType: S O O N N C C C C C C C C C H H H H H H
charge: 0.379548 -0.268257 -0.152596 -0.405946 0.022370 0.458387 -0.419837 -0.487825 0.161077 -0.219341 0.364550 -0.383752 -0.502225 -0.066825 0.281292 0.252335 0.261165 0.245410 0.235046 0.245423
chargesum: 0.00000
title: Mulliken charges with hydrogens summed into heavy atoms:
elementType: S O O N N C C C C C C C C C
charge: 0.379548 -0.268257 -0.152596 -0.405946 0.022370 0.458387 -0.419837 -0.206532 0.161077 0.032994 0.364550 -0.122588 0.223654 -0.066825
polarizability: 2.13711030e+02 -1.59003965e+01 1.53628906e+02 4.65997494e-03 -2.17285456e-03 5.41855082e+01
1716.lowfreq: -0.0009 0.0014 0.0018 4.2135 4.3694 5.0250 52.0584 56.0089 95.9924
frequency: 52.0571 56.0087 95.9906 138.9020 149.8588 159.8213 195.2891 266.7464 273.8398 337.3023 342.8460 376.3768 425.1835 468.1564 485.3627 504.6822 524.5878 530.7390 564.9095 588.4551 666.8124 699.8647 732.2181 736.5216 827.5040 858.1220 908.7284 937.6685 965.3378 1027.7856 1086.6732 1117.2058 1124.5860 1147.4384 1163.0277 1252.9961 1319.5037 1367.0950 1399.1311 1416.8432 1445.8289 1449.6886 1464.3011 1467.1264 1511.3940 1562.1710 1612.8207 2324.7251 3000.8580 3101.7308 3149.2389 3154.8332 3165.4116 3176.4828
redmass: 10.0784 11.2633 3.3315 2.1781 4.6881 1.7398 5.2167 5.8826 8.0878 8.8588 7.6673 8.3084 3.1347 5.7341 12.5685 10.9724 11.4665 5.5523 8.9492 8.3085 4.5496 7.7189 5.0806 7.7906 1.3915 6.9209 1.5206 6.6870 1.3513 6.0468 2.0684 1.2544 5.1164 1.3164 1.6340 1.3588 3.8581 3.9069 4.4767 2.0393 4.4890 1.0493 1.1687 1.9725 7.9309 8.0913 7.0956 12.7169 1.0295 1.1047 1.1050 1.0888 1.0935 1.0975
irintensity: 0.9883 0.6924 6.8183 0.0043 2.5956 0.0088 4.3506 7.5980 0.0079 0.5466 2.3103 9.4140 2.1931 9.8449 11.6427 0.3552 10.6411 25.1503 8.7864 11.9418 0.0174 4.8843 3.3013 19.0464 38.6053 4.9689 27.0423 57.6504 0.6227 6.6265 61.0998 0.0531 27.6012 3.4426 23.8310 6.8768 136.5610 77.9710 8.0941 52.6068 0.5012 14.6361 80.2561 69.3249 49.3498 9.0303 12.1454 1481.5596 40.4915 25.2738 17.6959 2.2553 1.6308 6.5476
temp: 298.150 k
press: 1.00000 atm
elementType: 16 8 8 7 7 6 6 6 6 6 6 6 6 6 1 1 1 1 1 1
symmnumber: 1
zpe: 352173.4 jmol-1
zpe.correction: 0.134136 hartree
zpe.thermalcorrener: 0.146547 hartree
zpe.thermalcorrenthalpy: 0.147491 hartree
zpe.thermalcorrgfe: 0.094420 hartree
zpe.sumelectzpe: -1003.570457 hartree
zpe.sumelectthermal: -1003.558046 hartree
zpe.sumelectthermalent: -1003.557102 hartree
zpe.sumelectthermalfe: -1003.610173 hartree
dipole: 1.4984 -0.6288 -0.0007
dipole: 1.6250
quadrupole: -103.3885 -74.4188 -88.7119
quadrupole: 13.8651 -0.0027 0.0016
quadrupole: -14.5488 14.4210 0.1278 13.8651 -0.0027 0.0016
hfenergy: -1003.7045931 hartree
pointgroup: C01 [X(C9H6N2O2S1)]
dipole: -0.575025 0.2702294 0.0709607 debye
dipolederiv: -0.2467425 -0.1179697 0.0436322 0.029945 -0.1685859 -0.0076119 0.0454338 0.01004 0.1318947 -0.5431818 -0.2412709 0.0280297 -0.5887861 -1.4581642 0.0534943 0.0233235 0.0125557 -0.2804081 -1.476785 0.6948243 0.1541019 0.9793906 -0.7826896 -0.1223368 0.1581299 -0.0889976 -0.2648236 -0.4229146 0.4942332 0.0194099 -0.2089477 -0.0456381 0.0280731 0.0101327 -0.0549919 -0.3151515 -1.5899268 0.6302862 0.1713449 1.1609359 -0.9463694 -0.1464568 0.1784774 -0.0841415 -0.225846 -0.2184607 -0.2302349 0.0313392 0.1193366 -0.3043091 -0.0191222 0.0359949 0.0220254 0.0701406 0.5863583 -0.1957937 -0.088107 -0.1881382 -0.1523316 0.0220181 -0.0879522 0.0229204 -0.1295347 -0.1215346 0.2522636 0.0018863 -0.0773276 0.0263902 0.0112249 -0.0027114 -0.0275332 -0.1339144 0.2676909 -0.0293764 -0.0148379 0.6526454 1.4221748 -0.0595959 -0.0055562 0.0207351 0.1459809 -0.2259425 0.0594234 0.0180737 0.0001892 0.1825464 0.0034198 0.0173445 -0.0036603 -0.0814726 1.2548616 -0.449649 -0.1418817 -0.5643886 0.2567756 0.0684039 -0.1432131 0.0549463 0.1147011 -0.0701168 0.0029541 -0.0109779 0.0931014 0.0445522 -0.0080716 -0.0099245 0.0025477 -0.1626976 0.5366415 0.4104639 -0.0248558 0.2490743 0.5622432 -0.0255617 -0.027039 -0.0445563 0.2818619 2.0867756 -1.1417207 -0.2247351 -1.6846556 1.3618966 0.212277 -0.232317 0.1485656 0.3351319 0.0829459 0.0277855 0.0111495 0.0507169 0.0048487 -0.0082355 0.0114588 -0.0054752 0.1732334 0.0785381 0.0538089 0.0106597 0.0127251 -0.047339 -0.0042724 0.0101374 -0.0090599 0.1618042 -0.0058988 -0.0866954 0.0191899 -0.0743711 0.0581535 0.0072731 0.0193397 0.008714 0.165175 -0.0063223 -0.0984597 0.0614789 0.0234095 0.0641002 -0.0716349 0.0750792 -0.0113233 -0.0731275 0.0749903 0.0559432 0.0065331 -0.0269492 -0.1398051 -0.0004772 0.0053892 -0.0102535 0.1228001 -0.0409761 -0.0908156 -0.0714334 0.0420944 0.0615505 0.0671927 -0.0815277 0.0369425 -0.0357478 unknown
polarizability: 210.1619987|-17.9169569|154.9454855|-18.5868375|3.4517049|56.41796 unknown
InChI: InChI=1S/C9H6N2O2S/c1-13-9-7-4-6(10-5-12)2-3-8(7)14-11-9/h2-4H,1H3
charge 0 multiplicity 1
20 atoms
S  -2.585847 1.768119 0.410599
O  -1.794151 -2.075958 0.265987
O  4.897831 -1.629762 -0.514777
N  -2.973693 -0.020717 0.432835
N  3.117587 0.012844 -0.283307
C  -0.576091 0.040322 0.150738
C  -0.813104 1.443773 0.197618
C  0.730485 -0.468669 -0.009781
C  -1.828988 -0.698877 0.288605
C  0.254729 2.360174 0.08426
C  1.800955 0.448672 -0.123136
C  1.557624 1.855871 -0.075624
C  -3.099803 -2.761629 0.410704
C  3.962425 -0.857994 -0.394319
H  0.898384 -1.54937 -0.043921
H  0.085051 3.440222 0.118416
H  2.409714 2.535883 -0.166568
H  -3.564794 -2.494136 1.374926
H  -2.857332 -3.832526 0.367169
H  -3.77578 -2.469244 -0.410923
