program: Gaussian 09
title: 000190763
version: EM64L-G09RevD.01
frameworkgroup: C1[X(C20H17N3O4)]
method: RPBEPBE
basis: SDD
operation: Freq
keyword: #p
keyword: freq=noraman
keyword: PBEPBE/SDD
title: #p freq=noraman PBEPBE/SDD
converged: YES YES NO NO
title: Mulliken charges:
elementType: O O O O N N N C C C C C C C C C C C C C C C C C C C C H H H H H H H H H H H H H H H H H
charge: -0.187672 -0.474556 -0.285891 -0.244798 -0.264710 0.044438 -0.696403 -0.049503 0.450076 0.433237 0.001901 -0.506332 -0.482106 0.388382 -0.324627 0.014559 -0.393008 -0.467222 0.155050 -0.513052 0.517393 -0.703922 -0.100066 -0.625707 -0.311740 0.526508 -0.421552 0.271660 0.273692 0.316012 0.214616 0.240835 0.241586 0.287444 0.256367 0.232783 0.240348 0.221032 0.370884 0.229421 0.267632 0.227449 0.315257 0.314307
chargesum: 0.00000
title: Mulliken charges with hydrogens summed into heavy atoms:
elementType: O O O O N N N C C C C C C C C C C C C C C C C C C C C
charge: -0.187672 -0.103672 -0.285891 -0.244798 -0.264710 0.044438 -0.066839 -0.049503 0.450076 0.433237 0.001901 0.039020 -0.166094 0.388382 -0.324627 0.014559 0.062443 0.061808 0.155050 -0.256685 0.517393 -0.009759 -0.100066 -0.396286 -0.044108 0.526508 -0.194103
polarizability: 5.09488777e+02 -3.44104084e+01 2.66203482e+02 -7.52332804e-01 8.90695849e+00 1.28401106e+02
1716.lowfreq: -5.3683 -4.0888 -1.0770 0.0001 0.0004 0.0008 28.6016 49.3660 56.7851
frequency: 28.5855 49.3647 56.7840 70.1725 90.6864 94.4268 113.1337 137.4104 156.1257 168.3452 181.5744 204.5607 220.6987 235.3267 250.3230 267.2944 272.2201 283.7078 289.3355 301.2606 328.8868 351.9898 371.5586 379.2375 389.3087 417.0657 427.9528 433.6920 436.3098 456.7115 468.5291 475.0893 502.3753 517.3443 543.6299 582.5857 584.6913 597.3400 628.9668 636.5985 647.5795 678.2446 697.2453 710.6806 722.6992 742.1300 753.0487 771.8206 781.9135 783.4127 791.6204 797.7934 836.2462 851.2015 880.9653 894.2809 904.9746 912.2773 942.0045 943.7076 967.3220 974.0556 977.8263 989.8009 991.8724 1044.3091 1058.4825 1063.0198 1093.3999 1106.1977 1113.4134 1140.8383 1152.9856 1161.6739 1167.9462 1177.3767 1192.4740 1208.3373 1217.3474 1230.5557 1250.2254 1273.4687 1276.1404 1305.0952 1308.4683 1323.7844 1341.5131 1349.0208 1376.7257 1385.2289 1393.6605 1403.5910 1434.7821 1442.5803 1451.5230 1464.1403 1470.5886 1475.6127 1478.9142 1487.1110 1517.9594 1539.0929 1552.7000 1567.4247 1621.2433 1630.9152 1638.7681 1644.9582 1651.7870 2989.8521 2993.3606 2997.4362 3003.5872 3050.5451 3051.5420 3083.5702 3097.1860 3103.8033 3113.8080 3128.1947 3130.6512 3167.8531 3212.7278 3439.1018 3562.3762 3701.8001
redmass: 6.0388 4.2704 4.6477 5.4423 3.8083 4.7909 4.9234 4.9991 3.3438 4.6058 3.5105 2.6685 2.9419 5.4331 2.5582 6.5124 3.4951 2.7219 3.3604 4.1827 5.8053 4.3747 4.3562 3.8305 1.0802 2.1534 2.8018 1.6341 1.6233 3.4889 5.3615 2.8928 5.7858 6.0411 7.5346 5.1931 6.0656 7.0545 4.9221 5.2529 4.6466 5.5645 6.0576 5.4040 5.7659 4.7051 5.0834 1.5751 4.8695 5.1839 2.2949 4.6327 1.8000 1.7244 1.7165 2.8207 3.8766 1.6665 3.2466 3.2646 2.6417 1.3548 2.3076 2.8704 1.9368 1.5654 2.7910 3.6305 2.9012 2.6064 2.9854 1.4534 2.1530 1.1092 2.1460 1.3555 1.4906 2.4743 2.7404 4.9611 1.9199 1.3407 2.3416 1.4725 2.5758 2.1843 2.0476 1.6260 2.5716 3.2768 1.2146 4.9500 4.2941 5.9925 1.0926 1.1617 1.1320 1.0474 5.0158 1.0515 4.5681 8.6038 8.4999 9.9925 8.1093 10.2796 3.1487 3.0606 2.1381 1.0365 1.0676 1.0596 1.0597 1.1030 1.1014 1.0997 1.1004 1.0959 1.0913 1.0892 1.0928 1.0959 1.0933 1.0649 1.0452 1.1040
irintensity: 1.2624 0.7724 0.0586 0.7185 1.4744 0.6760 0.6713 5.8067 1.3960 8.5403 3.0251 3.0743 0.2303 2.5291 9.9026 13.1141 2.0991 1.0886 8.7153 0.0642 19.4111 4.0142 13.4829 1.1520 65.5966 66.7126 9.1155 209.6678 57.7181 5.6710 12.9824 0.8850 6.5042 9.1420 2.3823 3.1047 1.7928 6.9299 1.4828 2.0120 12.3634 4.9134 1.5483 4.1713 1.4780 0.8451 0.1742 5.1220 1.0133 7.3164 0.1866 24.0141 56.7175 0.3841 52.1672 8.9193 14.0935 35.1129 4.1140 12.6503 38.4907 0.3093 46.5390 29.6168 5.1608 7.7810 8.5442 37.2073 79.7403 115.3053 0.3084 49.9579 3.6050 1.3413 6.1086 28.5324 19.8770 4.6019 6.4022 19.1117 1.7950 3.2901 20.2574 17.4343 60.2799 114.0006 31.8516 32.7108 5.2044 8.0421 16.4715 15.7713 4.7406 27.0452 4.4509 13.5195 18.2532 14.8763 4.5531 9.0343 126.5782 87.5897 52.2811 622.7519 105.7294 360.5264 28.5118 76.4418 465.5233 40.1195 26.1742 19.0630 6.0157 3.5950 6.6459 29.4236 23.7232 1.2703 24.1995 21.7504 13.1962 9.8050 10.0064 59.0108 188.2443 24.7001
temp: 298.150 k
press: 1.00000 atm
elementType: 8 8 8 8 7 7 7 6 6 6 6 6 6 6 6 6 6 6 6 6 6 6 6 6 6 6 6 1 1 1 1 1 1 1 1 1 1 1 1 1 1 1 1 1
symmnumber: 1
zpe: 879008.2 jmol-1
zpe.correction: 0.334797 hartree
zpe.thermalcorrener: 0.357332 hartree
zpe.thermalcorrenthalpy: 0.358276 hartree
zpe.thermalcorrgfe: 0.284045 hartree
zpe.sumelectzpe: -1235.628020 hartree
zpe.sumelectthermal: -1235.605485 hartree
zpe.sumelectthermalent: -1235.604541 hartree
zpe.sumelectthermalfe: -1235.678772 hartree
dipole: 10.4865 -0.1779 2.8017
dipole: 10.8558
quadrupole: -107.3917 -159.2679 -161.5105
quadrupole: 2.2280 -16.2948 -1.3199
quadrupole: 35.3317 -16.5446 -18.7871 2.2280 -16.2948 -1.3199
hfenergy: -1235.9628169 hartree
pointgroup: C01 [X(C20H17N3O4)]
dipole: 4.1328479 0.0415651 -1.0767139 debye
polarizability: 510.9224652|28.4424575|263.0968549|5.0543945|17.4339622|130.0740456 unknown
InChI: InChI=1S/C20H17N3O4/c1-2-20(26)14-7-16-17-11(5-10-6-12(21)3-4-15(10)22-17)8-23(16)18(24)13(14)9-27-19(20)25/h3-7,26H,2,8-9,21H2,1H3
charge 0 multiplicity 1
44 atoms
O  -5.026321 -0.686285 0.720865
O  -3.139194 2.497853 0.702966
O  -1.88877 -3.363922 -0.400117
O  -5.351533 1.339825 1.731858
N  -0.372552 -1.58769 -0.197448
N  2.141075 0.979666 0.126954
N  7.767952 0.554598 0.147822
C  -3.563883 1.259044 0.063797
C  -2.400453 0.27208 0.001413
C  -0.048991 -0.236863 -0.035679
C  -2.717752 -1.080988 -0.150675
C  0.824956 -2.467196 -0.285326
C  -1.048382 0.722516 0.070955
C  1.960004 -1.472995 -0.158788
C  1.415494 -0.14397 -0.01104
C  -1.689946 -2.10959 -0.258689
C  -4.0693 1.583396 -1.386349
C  -4.154317 -1.528123 -0.169045
C  -4.714333 0.6462 0.906237
C  3.336212 -1.645003 -0.163438
C  4.170701 -0.47935 -0.018608
C  -5.264454 2.554593 -1.421757
C  3.516011 0.817433 0.124322
C  5.591642 -0.552745 -0.010429
C  4.337078 1.983088 0.270144
C  6.378207 0.609178 0.135258
C  5.723097 1.888098 0.276389
H  0.813008 -3.018968 -1.243298
H  0.79234 -3.220635 0.523241
H  -0.808495 1.774037 0.225468
H  -4.316171 0.644515 -1.917572
H  -3.203963 2.031525 -1.909979
H  -4.60594 -1.495222 -1.179246
H  -4.250807 -2.552551 0.2213
H  3.797072 -2.633566 -0.272441
H  -6.164281 2.126812 -0.944118
H  -5.013192 3.495001 -0.90214
H  -5.52151 2.800844 -2.467472
H  -3.83581 2.727415 1.380745
H  6.076502 -1.531403 -0.118861
H  3.829569 2.946401 0.377126
H  6.336609 2.790187 0.390042
H  8.321745 1.400337 0.249061
H  8.258474 -0.329676 0.04805
