program: Gaussian 09
title: 000190739
version: EM64L-G09RevD.01
frameworkgroup: C1[X(C15H12ClN3O2S)]
method: RPBEPBE
basis: SDD
operation: Freq
keyword: #p
keyword: freq=noraman
keyword: PBEPBE/SDD
title: #p freq=noraman PBEPBE/SDD
converged: NO YES NO NO
title: Mulliken charges:
elementType: Cl S O O N N N C C C C C C C C C C C C C C C H H H H H H H H H H H H
charge: -0.061227 0.308412 -0.263580 -0.279728 -0.517086 -0.505262 -0.401117 -0.655040 0.375727 0.604932 -0.411148 -0.336818 0.162770 -0.202512 0.278012 0.497594 -0.441693 -0.314783 -0.184700 -0.199701 -0.120923 -0.505588 0.266614 0.309958 0.299317 0.231687 0.295873 0.223213 0.311786 0.255800 0.255111 0.244601 0.234947 0.244550
chargesum: 0.00000
title: Mulliken charges with hydrogens summed into heavy atoms:
elementType: Cl S O O N N N C C C C C C C C C C C C C C C
charge: -0.061227 0.308412 -0.263580 -0.279728 -0.217769 -0.209388 -0.401117 -0.655040 0.375727 0.604932 -0.144534 -0.026860 0.162770 0.029175 0.278012 0.497594 -0.218480 -0.002996 0.071099 0.055410 -0.120923 0.218510
polarizability: 4.13540056e+02 5.42971953e+00 2.23577440e+02 2.12834491e-02 1.83724083e-01 8.53887657e+01
1716.lowfreq: -13.2598 -3.8130 -3.1964 -0.0013 -0.0008 -0.0007 6.7395 19.9793 43.6600
frequency: 3.6143 19.9546 43.6575 44.9803 60.1694 82.0222 110.1096 118.8441 133.6805 155.1028 164.4791 192.0243 200.5385 241.0275 243.9158 289.1270 292.7378 307.9619 312.8110 364.7404 395.3018 409.6591 428.9593 437.7904 479.1999 499.0495 508.9897 518.0114 551.4735 552.6386 603.0856 609.4763 624.4083 663.9085 691.0138 696.2171 697.2828 702.1495 718.4792 768.3093 778.3634 809.1856 812.8939 835.3647 842.8594 891.3772 929.0325 933.0674 955.9686 977.0357 992.5954 993.8109 1022.4739 1033.2790 1075.2519 1087.4221 1115.0580 1115.9683 1152.0802 1169.7338 1179.4732 1184.8701 1202.5571 1260.7574 1293.7859 1301.2762 1353.0271 1359.6135 1375.9545 1401.9924 1410.6608 1411.7812 1449.2468 1460.9346 1464.3570 1478.4935 1482.6060 1510.5191 1519.1129 1592.5364 1596.9683 1603.8852 1608.8246 1655.8528 3000.1452 3100.7381 3116.4826 3148.4916 3148.9944 3166.6021 3175.0421 3175.2424 3198.1456 3200.4206 3512.6164 3528.3020
redmass: 4.5550 7.5103 7.9798 6.2860 5.9146 4.1494 7.7884 3.4920 4.7715 1.1572 6.6105 5.9946 5.5156 8.2403 3.6771 6.1956 9.4957 4.8422 4.3101 5.7920 9.8020 3.0050 1.7764 8.9470 5.3601 13.1097 2.6157 6.6713 4.2278 8.0732 1.2353 8.1489 7.2002 6.4597 7.2440 8.4711 7.2740 4.1882 3.2663 7.1503 6.8354 1.4018 1.5406 6.2096 1.4152 6.4648 1.3700 1.3602 8.2042 1.3194 4.2954 1.3236 6.2701 5.7171 2.5534 1.7555 1.2558 1.3323 1.5464 1.5369 2.6097 1.1319 1.6807 2.1280 1.3446 2.1576 2.9771 4.1308 5.6538 4.3639 2.0357 8.2468 1.0497 1.9893 1.0628 2.8164 2.9692 2.1437 2.2390 7.1287 5.3598 6.5303 6.2002 3.5088 1.0295 1.1047 1.0904 1.0885 1.1044 1.0912 1.0950 1.0961 1.0944 1.0950 1.0769 1.0759
irintensity: 1.8976 0.3395 0.1505 0.4986 14.4327 1.6314 0.9475 5.1079 0.3162 0.1763 3.6292 12.5063 1.1396 4.4662 3.8390 1.7048 9.7036 0.1471 0.1257 1.8870 32.5959 0.0333 0.0053 1.6317 8.0051 1.8948 49.9025 5.2900 1.6994 2.2108 120.3364 4.9962 1.0296 9.7701 43.1955 4.2970 21.4779 2.7557 17.7179 11.4024 1.6317 38.6403 66.4715 2.2044 65.9214 3.8494 2.5655 1.2038 31.6768 2.8797 40.5447 3.9380 10.5811 19.5547 60.9412 7.0742 0.0596 21.4143 5.4624 49.3143 343.4858 26.5619 40.0218 200.1822 51.2898 10.3187 514.0874 102.7846 101.6902 16.6769 26.2263 23.4673 14.4970 12.0889 25.9997 448.0702 23.3320 1034.2684 326.6572 69.5049 50.0889 36.3027 10.3467 103.9953 46.5394 25.7417 17.0949 7.8535 23.7179 2.2640 2.6950 5.7169 9.2881 8.7045 11.0021 15.7716
temp: 298.150 k
press: 1.00000 atm
elementType: 17 16 8 8 7 7 7 6 6 6 6 6 6 6 6 6 6 6 6 6 6 6 1 1 1 1 1 1 1 1 1 1 1 1
symmnumber: 1
zpe: 640540.6 jmol-1
zpe.correction: 0.243969 hartree
zpe.thermalcorrener: 0.264160 hartree
zpe.thermalcorrenthalpy: 0.265104 hartree
zpe.thermalcorrgfe: 0.190742 hartree
zpe.sumelectzpe: -1750.076582 hartree
zpe.sumelectthermal: -1750.056391 hartree
zpe.sumelectthermalent: -1750.055446 hartree
zpe.sumelectthermalfe: -1750.129809 hartree
dipole: 3.1011 -2.2301 0.0018
dipole: 3.8198
quadrupole: -143.8386 -132.6412 -147.6154
quadrupole: 7.6631 0.0894 0.0713
quadrupole: -2.4735 8.7238 -6.2504 7.6631 0.0894 0.0713
hfenergy: -1750.3205508 hartree
pointgroup: C01 [X(C15H12Cl1N3O2S1)]
dipole: -1.2201992 0.8606456 -0.1697933 debye
polarizability: 412.8408914|7.6430279|221.2331027|14.0592313|-17.8663632|88.4322672 unknown
InChI: InChI=1S/C15H12ClN3O2S/c1-21-14-11-3-2-4-12(13(11)22-19-14)18-15(20)17-10-7-5-9(16)6-8-10/h2-8,17-18H,1H3
charge 0 multiplicity 1
34 atoms
Cl 8.178228 0.226153 0.237935
S  -2.813362 1.870736 -0.497593
O  -6.218829 -0.066487 -0.387793
O  1.423797 -1.651812 0.162515
N  -0.142722 0.086049 -0.1417
N  2.136176 0.58133 -0.103313
N  -4.631152 1.686823 -0.552081
C  -2.575009 0.075715 -0.248551
C  -3.834634 -0.575629 -0.217453
C  -1.360504 -0.643524 -0.099123
C  -3.917368 -1.977155 -0.035416
C  -1.451191 -2.047616 0.083482
C  -4.918711 0.387646 -0.392163
C  -2.715426 -2.692204 0.112655
C  1.162626 -0.427375 -0.013265
C  3.548685 0.432494 -0.014205
C  4.332492 1.612132 -0.13871
C  4.194519 -0.81673 0.189699
C  5.738217 1.55594 -0.06272
C  5.602648 -0.872383 0.26559
C  6.357632 0.307952 0.139129
C  -7.269305 0.962483 -0.567643
H  -4.894004 -2.46831 -0.013609
H  -0.529302 -2.619179 0.200981
H  -0.244884 1.094341 -0.278715
H  -2.743144 -3.77743 0.255107
H  1.818961 1.542273 -0.248763
H  3.847027 2.583786 -0.296249
H  3.595749 -1.723355 0.286012
H  6.336253 2.466097 -0.159236
H  6.101633 -1.8330 0.422423
H  -7.140069 1.473201 -1.537121
H  -8.213836 0.402073 -0.533691
H  -7.215191 1.707662 0.244288
