program: Gaussian 09
title: 000190730
version: EM64L-G09RevD.01
frameworkgroup: C1[X(C15H13N3O2S)]
method: RPBEPBE
basis: SDD
operation: Freq
keyword: #p
keyword: freq=noraman
keyword: PBEPBE/SDD
title: #p freq=noraman PBEPBE/SDD
converged: NO YES NO NO
title: Mulliken charges:
elementType: S O O N N N C C C C C C C C C C C C C C C H H H H H H H H H H H H H
charge: 0.362356 -0.261493 -0.279745 -0.519516 -0.503837 -0.411712 0.467913 0.529752 -0.434255 -0.463658 -0.479121 -0.244858 0.143534 0.266883 0.479079 -0.449064 -0.332368 -0.197497 -0.214627 -0.257615 -0.503291 0.337641 0.220280 0.245148 0.291265 0.287944 0.212838 0.307252 0.225958 0.226735 0.229344 0.242104 0.234347 0.242283
chargesum: 0.00000
title: Mulliken charges with hydrogens summed into heavy atoms:
elementType: S O O N N N C C C C C C C C C C C C C C C
charge: 0.362356 -0.261493 -0.279745 -0.228250 -0.215893 -0.411712 0.467913 0.529752 -0.434255 -0.126017 -0.258841 0.000290 0.143534 0.266883 0.479079 -0.236225 -0.025116 0.028461 0.012108 -0.028271 0.215442
polarizability: 3.66806804e+02 -7.35657752e+00 2.31131868e+02 -1.60908691e-01 -2.67287837e-01 8.30388030e+01
1716.lowfreq: -11.4618 -3.9952 0.0008 0.0010 0.0015 2.1791 8.3640 25.2919 48.8526
frequency: 7.3662 25.2551 48.8519 61.5102 73.8062 94.5079 122.5580 129.5035 154.8978 191.5916 194.2395 205.9910 228.0643 268.7169 277.6409 325.1963 348.2211 357.5829 406.7263 408.3296 422.0489 447.8429 487.5087 507.5180 518.9781 538.2552 561.4296 573.7945 613.8195 614.2342 667.2860 674.8375 695.1658 698.4430 699.1600 736.6626 757.3197 764.8773 765.9787 810.9527 837.6637 839.3152 912.6411 913.1437 939.5221 945.2358 956.2539 970.0025 982.9287 997.9229 998.7345 1026.6539 1032.2577 1090.3317 1105.4995 1115.7864 1160.5654 1163.1021 1172.3869 1179.3888 1188.8422 1233.5256 1256.1605 1274.9858 1315.6344 1326.3017 1384.3516 1384.7734 1404.3700 1428.9285 1436.6226 1448.6455 1455.8444 1465.3571 1480.4033 1488.3896 1510.7395 1516.0288 1582.2091 1602.1765 1616.4441 1619.4618 1652.3219 2998.8895 3098.4181 3103.7330 3114.0374 3132.7970 3144.8433 3147.8188 3161.4324 3166.2495 3198.9456 3199.2340 3519.3046 3533.1498
redmass: 3.9265 8.1004 5.8722 7.2464 5.3710 3.3905 4.9747 2.9536 1.2712 6.3822 4.8445 6.0616 3.1518 6.7129 5.4560 4.5611 7.2194 6.2837 2.9300 7.8966 2.9178 1.7324 7.1097 9.2579 2.8071 4.3642 8.9592 7.4356 1.1908 6.2600 4.0809 7.1299 1.9862 8.2510 10.1108 5.7631 7.0074 1.7036 6.8969 1.5004 5.9599 1.2720 7.3681 1.4316 1.4040 1.3769 4.5450 1.3507 6.0416 5.5136 1.3061 3.7588 2.8104 1.5619 2.3081 1.2556 1.4905 1.5539 1.0518 2.2398 1.1137 1.9629 1.7141 1.9575 2.0399 2.2229 5.8640 3.2352 4.5469 2.5003 2.7226 1.0499 2.1130 1.1078 3.1930 2.6137 2.1655 2.1277 5.4224 5.4592 6.0852 6.4969 3.8342 1.0295 1.1045 1.0890 1.0894 1.0865 1.0932 1.1048 1.0951 1.0999 1.0942 1.0938 1.0765 1.0757
irintensity: 0.8945 0.0151 0.2848 6.8153 6.3045 5.3424 4.1949 0.9634 0.3467 1.7491 2.6255 2.2800 1.5871 0.2238 8.4102 0.0304 2.0615 4.0504 0.0131 12.7443 3.1756 1.2759 6.5960 5.5744 45.9239 14.1899 5.1765 0.4755 113.2501 2.2942 2.0973 1.9738 52.5273 21.3966 14.1685 5.4488 6.7843 94.1580 4.2757 55.8984 1.1529 0.2347 7.8095 13.0538 16.2582 15.3171 39.1441 0.1898 1.9763 4.7939 3.0877 2.1463 15.7967 12.5666 26.8031 0.0819 23.3924 52.2275 0.5135 264.7647 7.8103 191.7942 85.1716 0.8452 107.7237 172.5616 170.2321 74.0119 25.9021 109.2311 1.3419 13.7882 272.8892 11.9299 540.1096 0.5028 563.6140 312.4530 57.8485 47.6904 93.6192 6.9326 96.8397 45.3097 27.4535 19.1664 18.3714 0.1265 29.6825 17.5232 9.3196 28.3595 21.7181 2.3893 8.3434 15.8701
temp: 298.150 k
press: 1.00000 atm
elementType: 16 8 8 7 7 7 6 6 6 6 6 6 6 6 6 6 6 6 6 6 6 1 1 1 1 1 1 1 1 1 1 1 1 1
symmnumber: 1
zpe: 666423.9 jmol-1
zpe.correction: 0.253827 hartree
zpe.thermalcorrener: 0.272517 hartree
zpe.thermalcorrenthalpy: 0.273461 hartree
zpe.thermalcorrgfe: 0.203818 hartree
zpe.sumelectzpe: -1290.686212 hartree
zpe.sumelectthermal: -1290.667523 hartree
zpe.sumelectthermalent: -1290.666578 hartree
zpe.sumelectthermalfe: -1290.736222 hartree
dipole: -2.9842 -3.9897 0.0177
dipole: 4.9824
quadrupole: -128.8796 -100.8437 -136.1722
quadrupole: 9.9084 0.0221 -0.0572
quadrupole: -6.9145 21.1215 -14.2070 9.9084 0.0221 -0.0572
hfenergy: -1290.9400399 hartree
pointgroup: C01 [X(C15H13N3O2S1)]
dipole: 1.125431 1.5973068 0.1563213 debye
polarizability: 366.7708493|-3.9561379|230.0948177|9.7951219|10.26108|84.1118076 unknown
InChI: InChI=1S/C15H13N3O2S/c1-20-14-12-9-11(7-8-13(12)21-18-14)17-15(19)16-10-5-3-2-4-6-10/h2-9,16-17H,1H3
charge 0 multiplicity 1
34 atoms
S  -5.525947 0.718793 -0.275691
O  -3.225552 -2.45884 -0.402409
O  1.22833 -0.742177 -0.134011
N  0.465782 1.484446 -0.002555
N  2.756937 1.047225 0.050028
N  -5.147524 -1.066204 -0.381027
C  -2.966845 -0.032082 -0.232185
C  -0.942215 1.291723 -0.068138
C  -3.760949 1.146543 -0.181893
C  -1.555942 0.022366 -0.17689
C  -1.748546 2.47347 -0.017847
C  -3.151925 2.41326 -0.073967
C  -3.817163 -1.215914 -0.342231
C  1.467856 0.495504 -0.036791
C  4.004535 0.358439 0.041748
C  5.178685 1.153988 0.146571
C  4.121067 -1.053339 -0.065427
C  6.451885 0.550421 0.144578
C  5.404663 -1.640611 -0.065763
C  6.574592 -0.854355 0.038157
C  -4.146799 -3.612301 -0.507367
H  -0.956313 -0.887901 -0.217478
H  -1.262222 3.454119 0.066763
H  -3.743788 3.332368 -0.033697
H  0.758974 2.46032 0.074638
H  2.837884 2.063359 0.128548
H  5.094759 2.246159 0.229199
H  3.218978 -1.661552 -0.145538
H  7.346153 1.178031 0.225962
H  5.486065 -2.730254 -0.148584
H  7.563062 -1.325234 0.03653
H  -4.8165 -3.646523 0.3691
H  -3.487035 -4.490447 -0.541342
H  -4.756444 -3.531901 -1.42369
