program: Gaussian 09
title: 000190727
version: EM64L-G09RevD.01
frameworkgroup: C1[X(C9H9N3O2S)]
method: RPBEPBE
basis: SDD
operation: Freq
keyword: #p
keyword: freq=noraman
keyword: PBEPBE/SDD
title: #p freq=noraman PBEPBE/SDD
converged: YES YES NO NO
title: Mulliken charges:
elementType: S O O N N N C C C C C C C C C H H H H H H H H H
charge: 0.359668 -0.260744 -0.283655 -0.486027 -0.413093 -0.661048 0.466059 -0.432945 0.533233 -0.477573 -0.245416 0.147098 -0.469009 0.261903 -0.503649 0.339722 0.244029 0.217890 0.291916 0.241607 0.234171 0.241589 0.349148 0.305126
chargesum: 0.00000
title: Mulliken charges with hydrogens summed into heavy atoms:
elementType: S O O N N N C C C C C C C C C
charge: 0.359668 -0.260744 -0.283655 -0.194111 -0.413093 -0.006774 0.466059 -0.432945 0.533233 -0.137852 -0.001387 0.147098 -0.251118 0.261903 0.213718
polarizability: 2.17942998e+02 2.46551975e-01 1.65033538e+02 2.32047560e-02 -1.52533209e-02 6.01096285e+01
1716.lowfreq: -4.2085 0.0006 0.0011 0.0015 3.6903 4.6395 38.0414 53.9769 95.8527
frequency: 37.9638 53.9628 95.8514 96.4704 132.8883 159.1124 176.2924 195.1202 259.7772 264.5035 280.8919 302.7108 343.8569 348.8952 427.8094 433.4620 494.6997 502.1295 517.0504 535.1603 562.4462 583.5913 591.4234 668.5587 698.6582 704.8297 713.2678 737.7365 768.6451 812.3308 897.3234 941.2266 942.1270 949.1400 982.4394 1028.6961 1043.4699 1105.2632 1116.7108 1160.5175 1164.5017 1230.6348 1262.7811 1291.7834 1341.0466 1387.2163 1404.7658 1434.9395 1449.2177 1457.0737 1465.7892 1483.2497 1509.4747 1577.4867 1610.7472 1619.1653 1661.8569 2997.1042 3096.2246 3113.5929 3145.8235 3159.9592 3193.0367 3533.6710 3544.1961 3697.1692
redmass: 5.1081 5.8036 5.3211 3.3424 2.9526 1.2395 5.0554 4.3880 2.0521 6.4055 2.6963 5.2511 4.5216 6.0575 3.2683 5.1579 1.1449 10.7033 5.2515 4.6547 8.1767 1.2183 4.8767 4.1222 8.2192 6.8833 9.0937 5.8431 6.6418 1.5010 5.4444 1.3839 5.3748 1.3792 3.4146 6.8665 1.9331 2.3683 1.2549 1.4794 1.3774 1.9449 1.5911 2.8506 3.6554 3.2183 4.9454 2.8176 1.0498 2.0379 1.1227 3.8486 2.4775 4.7418 1.3149 6.5559 3.7188 1.0296 1.1044 1.0893 1.1047 1.0951 1.0935 1.0674 1.0543 1.1039
irintensity: 22.5702 0.5529 6.6017 5.6183 0.1110 0.0226 1.6269 5.4233 9.3426 6.5260 12.2811 5.8527 5.0677 2.6749 10.4442 5.3717 312.2407 1.6951 14.0332 29.4335 7.1656 64.6694 1.8928 1.7713 23.8189 1.6983 23.6662 6.3608 5.7255 57.1003 3.3699 9.8511 30.9707 22.6274 13.5610 9.0530 29.9330 26.9798 0.0947 28.3390 1.4577 21.6438 59.6505 148.4441 249.2949 113.1556 39.9653 3.4618 13.7848 184.6877 12.7199 263.1261 495.9718 82.5295 37.6806 26.0322 265.1423 45.2626 28.1468 18.7726 18.6323 9.8241 15.6336 19.7858 56.0565 42.7804
temp: 298.150 k
press: 1.00000 atm
elementType: 16 8 8 7 7 7 6 6 6 6 6 6 6 6 6 1 1 1 1 1 1 1 1 1
symmnumber: 1
zpe: 457568.7 jmol-1
zpe.correction: 0.174279 hartree
zpe.thermalcorrener: 0.188432 hartree
zpe.thermalcorrenthalpy: 0.189376 hartree
zpe.thermalcorrgfe: 0.132597 hartree
zpe.sumelectzpe: -1060.044712 hartree
zpe.sumelectthermal: -1060.030559 hartree
zpe.sumelectthermalent: -1060.029615 hartree
zpe.sumelectthermalfe: -1060.086393 hartree
dipole: 5.0362 -2.9993 -0.0058
dipole: 5.8617
quadrupole: -68.6553 -83.3851 -98.5141
quadrupole: -17.0054 -0.1111 -0.0017
quadrupole: 14.8629 0.1331 -14.9960 -17.0054 -0.1111 -0.0017
hfenergy: -1060.2189903 hartree
pointgroup: C01 [X(C9H9N3O2S1)]
dipole: -1.9215591 -1.2564907 0.217401 debye
dipolederiv: -0.2267491 -0.0956172 0.0306176 0.0528353 -0.2159122 0.0167377 0.0215838 0.0269617 0.117634 -0.4241492 -0.0615359 0.0147055 -0.3713704 -1.558019 0.105924 0.0341484 0.0833095 -0.2806879 -0.7635697 -0.0956368 0.0347284 0.1538811 -0.9687951 0.0251789 0.0207387 0.0428557 -0.3808729 -1.7199881 0.4270013 0.0739904 1.0454188 -0.6580834 -0.0571104 0.0369754 -0.0127336 -0.3571843 -0.4756029 0.3835523 -0.0123663 -0.310534 -0.001078 0.0032146 0.0301721 -0.0459947 -0.3168537 -1.6812973 0.0520833 0.0610406 -0.0003383 -0.2524503 -0.0347483 0.0633577 -0.038374 -0.7906947 -0.0452408 -0.2480056 0.0219623 0.0953003 -0.2899829 0.0142636 0.0010426 0.0389284 0.0518205 0.5539702 -0.0822593 -0.0444862 0.0203579 -0.2450898 0.0048052 -0.0506897 0.0118651 -0.1396856 1.5586765 -0.3234797 -0.085675 -0.0756651 -0.1353851 0.01943 -0.1009846 0.0375761 0.1055262 -0.3148711 0.2483256 -0.0021623 -0.2064947 0.0339454 0.0045383 0.0251445 -0.0279991 -0.139127 -0.1604485 0.0677383 0.0012095 -0.0570315 0.1895923 -0.0124351 0.0087637 -0.0213318 -0.0852727 0.1969353 -0.2235354 0.0107767 0.3822087 1.4836847 -0.1096911 -0.0268647 -0.0658426 0.1507568 -0.160354 -0.0564801 -0.00003 0.1471811 0.0611104 -0.0270624 -0.012208 -0.0123931 -0.2098862 2.4411502 -0.1460325 -0.1468564 -0.9582649 1.5268189 -0.0018547 -0.1004296 -0.0602257 0.353856 0.4164174 0.382545 -0.0332391 0.2139471 0.6712222 -0.0395164 -0.0229695 -0.0520437 0.2873172 0.2128753 -0.0058899 -0.0017678 -0.0180926 0.1010607 0.0063263 -0.0008863 0.0054261 0.1848176 0.0631328 0.0745813 0.0026481 0.0332701 -0.0504458 0.0103882 0.0050635 0.0074131 0.1620012 -0.0635944 -0.1363631 0.0244912 -0.1033653 -0.0052703 0.0175826 0.0225814 0.0199885 0.1614891 0.12199 0.008379 0.0137133 -0.0182692 0.075506 0.0157981 0.0158334 0.0136774 0.3175535 -0.0275592 -0.1169594 -0.0793941 0.0174092 0.0518441 0.0469561 -0.0916202 0.0070506 -0.0517636 0.0647788 0.0948345 -0.0020161 0.011516 -0.1336897 0.0153735 0.0032407 0.0094834 0.1207863 -0.0026609 -0.1070009 0.0866119 0.0208396 0.0441685 -0.0638775 0.0824147 -0.0047777 -0.0686445 0.2345622 -0.0234431 0.0145346 -0.0606641 0.1802858 0.0182986 0.0171254 0.015419 0.4008947 0.2015966 -0.0168019 0.0169634 -0.0140752 0.0949625 0.02148 0.0184666 0.0217614 0.4062199 unknown
polarizability: 217.0476472|1.423247|164.717175|-11.394106|-6.4448112|61.3213426 unknown
InChI: InChI=1S/C9H9N3O2S/c1-14-8-6-4-5(11-9(10)13)2-3-7(6)15-12-8/h2-4,11H,10H2,1H3
charge 0 multiplicity 1
24 atoms
S  3.156435 -1.408903 -0.318562
O  1.673862 2.223161 -0.433784
O  -3.060495 1.625518 -0.05699
N  -2.838902 -0.725285 0.068732
N  3.210107 0.414231 -0.432269
N  -4.952228 0.290139 0.165383
C  0.849143 -0.072166 -0.234867
C  1.342441 -1.405544 -0.189722
C  -1.428312 -0.877333 -0.023688
C  -0.533301 0.209979 -0.153178
C  0.451989 -2.491174 -0.061221
C  1.954017 0.875375 -0.371098
C  -0.924572 -2.21651 0.020588
C  -3.572591 0.473516 0.051162
C  2.840142 3.122588 -0.575814
H  -0.902342 1.236331 -0.188301
H  0.809337 -3.524641 -0.024892
H  -1.628247 -3.05328 0.121142
H  -3.363198 -1.597369 0.157572
H  3.520316 3.005293 0.285457
H  2.407833 4.132431 -0.609423
H  3.390839 2.890248 -1.503703
H  -5.520734 1.133234 0.156605
H  -5.41184 -0.612937 0.259873
