program: Gaussian 09
title: 000190725
version: EM64L-G09RevD.01
frameworkgroup: C1[X(C10H11N3O2S)]
method: RPBEPBE
basis: SDD
operation: Freq
keyword: #p
keyword: freq=noraman
keyword: PBEPBE/SDD
title: #p freq=noraman PBEPBE/SDD
converged: YES YES NO NO
title: Mulliken charges:
elementType: S O O N N N C C C C C C C C C C H H H H H H H H H H H
charge: 0.360495 -0.274984 -0.223980 -0.469696 -0.336293 -0.115416 0.338874 0.226252 -0.364798 -0.340697 -0.254884 -0.242722 -0.221757 0.274926 -0.598728 -0.484657 0.223920 0.352763 0.247553 0.231733 0.234299 0.236472 0.222142 0.280504 0.231805 0.238710 0.228165
chargesum: 0.00000
title: Mulliken charges with hydrogens summed into heavy atoms:
elementType: S O O N N N C C C C C C C C C C
charge: 0.360495 -0.274984 -0.223980 -0.116933 -0.336293 -0.115416 0.338874 0.226252 -0.364798 -0.116777 -0.007331 -0.010990 0.012542 0.274926 0.140389 0.214023
polarizability: 2.19976518e+02 4.11232919e+00 1.77264654e+02 3.08321231e+00 -6.94281353e+00 7.89154229e+01
1716.lowfreq: -7.1357 0.0013 0.0021 0.0021 2.6198 5.5030 16.1291 43.4800 62.4355
frequency: 16.1251 43.4771 62.4323 86.1596 105.1125 140.5036 160.8602 169.9549 180.0714 193.6778 217.4273 238.9059 293.1100 329.0140 369.5978 399.1256 420.7896 446.5300 486.5040 488.3907 519.9012 558.4681 579.0700 637.1190 654.0406 684.2144 693.1296 711.9949 736.6548 762.4705 771.5165 855.9376 860.5891 924.5130 943.7957 949.6583 986.1202 1021.2924 1027.2949 1070.4056 1099.2063 1110.5560 1127.8617 1141.5685 1146.8189 1156.5151 1178.2562 1254.2632 1279.2108 1334.9192 1394.8349 1405.3713 1416.3312 1419.8863 1443.1431 1444.6140 1465.4933 1472.5731 1482.3037 1486.6596 1506.8768 1575.5667 1597.0902 1650.3351 2978.5174 2982.4743 3073.9934 3087.5146 3117.6014 3121.9104 3122.6385 3139.3512 3155.7433 3170.4441 3486.0728
redmass: 5.5053 3.7086 4.1380 3.8534 4.8252 2.1158 2.5848 1.5739 1.2397 6.0118 6.9572 5.3770 8.7326 3.8881 8.0629 4.0295 3.0215 7.2409 5.3086 7.2802 8.0324 5.3413 8.5101 4.9471 2.1817 6.6661 8.0252 2.1947 1.9643 4.2144 2.1879 1.6994 3.1349 6.4232 1.4771 4.5326 1.3277 2.4906 7.2885 4.5157 1.6280 1.2605 1.9023 1.6458 1.4913 1.8972 1.1317 1.8621 2.0983 3.9556 7.1703 1.1461 1.3515 1.9042 1.7336 1.2980 1.0521 1.0881 1.0873 4.0703 2.4916 6.2807 6.4734 7.7411 1.0366 1.0287 1.0988 1.1058 1.1040 1.0883 1.0991 1.0878 1.0941 1.1003 1.0753
irintensity: 0.8246 1.6389 2.3527 2.7772 2.5574 4.5627 0.9959 0.3014 3.3557 0.0532 0.6652 14.7576 5.8341 4.9654 2.8167 23.8812 5.1442 34.4564 5.3534 0.7031 6.4277 13.6416 28.6283 2.6723 18.0629 7.2325 3.3728 42.9214 115.8506 14.3475 28.3712 2.9236 13.7248 35.2720 1.0769 20.0073 0.0247 7.4407 13.3531 32.7515 115.0154 0.3568 2.5333 23.9659 7.5828 12.5920 5.1651 15.2197 60.4715 38.1676 11.9207 29.2400 10.7107 20.3157 41.0868 45.2925 44.5442 10.0726 32.8695 48.3651 881.2933 3.1551 29.4211 199.6726 59.3125 49.1477 30.8233 39.6384 16.2728 6.7949 5.2770 4.8981 15.3721 22.3392 70.9636
temp: 298.150 k
press: 1.00000 atm
elementType: 16 8 8 7 7 7 6 6 6 6 6 6 6 6 6 6 1 1 1 1 1 1 1 1 1 1 1
symmnumber: 1
zpe: 525295.0 jmol-1
zpe.correction: 0.200074 hartree
zpe.thermalcorrener: 0.215661 hartree
zpe.thermalcorrenthalpy: 0.216606 hartree
zpe.thermalcorrgfe: 0.155446 hartree
zpe.sumelectzpe: -1099.200393 hartree
zpe.sumelectthermal: -1099.184806 hartree
zpe.sumelectthermalent: -1099.183862 hartree
zpe.sumelectthermalfe: -1099.245021 hartree
dipole: -0.7692 6.6950 0.8458
dipole: 6.7919
quadrupole: -72.6474 -105.0717 -101.8665
quadrupole: -5.3111 -3.7568 1.5313
quadrupole: 20.5478 -11.8765 -8.6713 -5.3111 -3.7568 1.5313
hfenergy: -1099.4004675 hartree
pointgroup: C01 [X(C10H11N3O2S1)]
dipole: -0.0337802 2.6643961 0.2005334 debye
polarizability: 220.4063339|-0.2854322|175.9103673|0.4571203|-12.0605014|79.8398938 unknown
InChI: InChI=1S/C10H11N3O2S/c1-13(15-2)10(14)11-9-7-5-3-4-6-8(7)16-12-9/h3-6,11H,1-2H3
charge 0 multiplicity 1
27 atoms
S  2.247374 -2.417048 0.623034
O  -2.879797 1.586897 0.08247
O  -2.377805 -1.974897 -0.28469
N  -0.931553 -0.123774 0.114696
N  0.461837 -2.027488 0.557053
N  -3.260604 0.157084 0.081345
C  1.54138 0.066159 0.00741
C  0.326697 -0.732482 0.223075
C  2.714813 -0.719702 0.204972
C  1.66885 1.431377 -0.358461
C  4.005881 -0.169364 0.056208
C  2.952896 1.988119 -0.504435
C  4.113905 1.192452 -0.295025
C  -2.173602 -0.756104 -0.058098
C  -4.535818 -0.095351 -0.604783
C  -3.292294 2.194076 1.372661
H  0.782666 2.050613 -0.543292
H  -0.978803 0.900425 0.11079
H  4.902534 -0.778453 0.206962
H  3.061606 3.039922 -0.788476
H  5.106023 1.641185 -0.414059
H  -4.53189 0.313217 -1.633596
H  -5.367414 0.3500 -0.033347
H  -4.669769 -1.187559 -0.646034
H  -2.9567 3.241949 1.305887
H  -2.808777 1.677166 2.220176
H  -4.390437 2.156682 1.48446
