program: Gaussian 09
title: 000190761
version: EM64L-G09RevD.01
frameworkgroup: C1[X(C18H18N2O3)]
method: RPBEPBE
basis: SDD
operation: Freq
keyword: #p
keyword: freq=noraman
keyword: PBEPBE/SDD
title: #p freq=noraman PBEPBE/SDD
converged: YES YES NO NO
title: Mulliken charges:
elementType: O O O N N C C C C C C C C C C C C C C C C C C H H H H H H H H H H H H H H H H H H
charge: -0.247914 -0.308109 -0.300857 -0.029321 -0.376369 -0.344925 0.366021 0.272750 0.180128 -0.467276 0.438860 -0.404287 -0.433697 0.236516 0.046759 -0.869186 -0.818867 -0.368201 -0.346538 -0.211825 -0.220875 0.339198 -0.606518 0.295000 0.264569 0.228194 0.228896 0.224810 0.288180 0.226613 0.233665 0.229068 0.219969 0.256019 0.255864 0.232344 0.231040 0.329956 0.229276 0.230153 0.270914
chargesum: 0.00000
title: Mulliken charges with hydrogens summed into heavy atoms:
elementType: O O O N N C C C C C C C C C C C C C C C C C C
charge: -0.247914 -0.308109 -0.300857 -0.029321 -0.046413 -0.049925 0.366021 0.272750 0.180128 -0.202707 0.438860 -0.176093 -0.204801 0.236516 0.046759 -0.129583 -0.136165 -0.112182 -0.090674 0.020519 0.010165 0.339198 0.123825
polarizability: 2.76248027e+02 -9.11927341e+00 2.06675021e+02 1.04980378e+01 2.63217211e+01 1.88500759e+02
1716.lowfreq: -9.0157 -4.9254 -1.9116 0.0004 0.0006 0.0007 13.2837 16.4660 22.2898
frequency: 9.2442 16.0221 21.9169 39.6266 43.3199 52.5998 70.0862 105.4008 120.6940 134.8912 147.6349 173.9435 178.1649 196.5545 202.9352 224.2872 254.0934 260.8008 299.8152 314.3080 335.4180 343.7617 423.1896 438.9509 443.6041 452.4331 463.9862 512.8894 544.8128 575.4960 583.1017 589.8949 610.7748 619.5143 648.9578 692.9628 699.6309 714.1662 736.7231 754.2223 757.9378 766.6858 783.9733 821.1186 832.2367 856.9142 863.0282 865.9537 891.7612 901.3681 921.9344 936.5990 944.1286 960.3426 982.5665 1001.1263 1003.6879 1016.1232 1049.2039 1056.0810 1066.0863 1088.6292 1101.9807 1114.1660 1126.3755 1145.9829 1155.6284 1168.6179 1173.4528 1203.6751 1222.2761 1233.4880 1253.4829 1280.6313 1293.7516 1312.5567 1341.0645 1381.2895 1398.6930 1401.6998 1406.2506 1415.3503 1430.2742 1433.1705 1460.6232 1461.2979 1469.6661 1474.0543 1479.1890 1484.3697 1495.2056 1502.3327 1516.0977 1542.8582 1584.2800 1609.9468 1620.8007 1626.8910 1674.9166 2971.7185 2976.1842 2980.1724 3051.5151 3054.8304 3058.0335 3072.7552 3081.9486 3083.8912 3113.8292 3113.9281 3138.1904 3139.9317 3148.3238 3157.1750 3175.1958 3182.5195 3576.4380
redmass: 1.1844 3.5056 4.1522 4.9611 3.9608 4.6076 4.5373 1.1665 4.3401 2.9414 3.7874 4.8518 3.7333 4.6960 1.2626 3.7326 6.1606 5.0478 4.0091 3.3662 3.7676 4.9388 3.2085 4.1262 3.4111 3.4819 5.0130 4.1160 6.3186 3.8414 1.1368 4.3991 6.9720 7.0638 6.4485 11.4320 5.8350 4.5331 3.8015 1.9454 4.7792 2.1317 5.4859 1.4090 5.0283 4.6666 1.4704 7.0241 6.5413 1.7104 4.0324 2.5628 1.3814 1.3718 1.3077 2.0599 1.9418 1.3598 1.5594 1.5746 3.6775 5.3387 1.8495 2.4315 1.2801 1.6541 1.2878 1.4787 2.3894 2.2545 1.7870 2.8253 3.2731 1.4852 1.4786 1.2815 2.5658 2.8868 1.3493 3.4346 1.3534 2.5061 1.1633 3.0538 2.6546 1.3186 1.0469 1.0831 1.0739 1.0441 1.1232 2.6705 1.4119 9.9286 5.6374 7.8498 7.9857 6.3872 8.8850 1.0382 1.0370 1.0354 1.0970 1.0976 1.1027 1.0837 1.0989 1.0983 1.0871 1.0981 1.0963 1.0864 1.0923 1.0915 1.0959 1.0990 1.0773
irintensity: 0.2316 0.5395 0.0443 0.3331 0.5832 6.2519 3.3918 0.3345 1.7454 1.1159 4.7092 2.0396 1.3170 1.3839 0.3514 0.9100 0.1799 4.6100 12.0647 3.8914 3.0084 11.0850 2.0305 13.1358 0.9671 12.4468 0.1752 12.4304 4.2359 0.7665 122.7957 5.5396 0.8286 5.0643 7.0335 22.9647 0.2839 2.4793 0.4493 53.8750 5.5500 51.0980 20.5799 65.6839 19.3622 40.6745 1.2204 11.6165 86.2093 45.7003 155.5929 20.3999 4.6029 1.7973 0.0037 7.5155 6.4289 4.4102 5.4081 16.1371 50.2522 237.4604 13.0846 3.3521 0.0719 30.2655 3.8102 15.4543 1.3403 266.8863 5.8559 27.4142 6.4933 2.5540 10.9968 10.1822 0.6187 3.5474 21.4734 9.2256 10.4730 6.3670 26.8970 22.0113 5.9989 165.7603 13.2460 2.4327 8.1699 13.6918 31.0575 34.0829 170.4802 16.7789 2.9181 2.6944 1.1787 2.7338 258.2983 30.5195 37.9899 85.9939 9.7005 20.3818 35.3664 12.4794 20.6039 24.0013 12.7112 4.5131 39.9208 3.2993 1.3455 14.2145 9.9116 12.6902 36.1948
temp: 298.150 k
press: 1.00000 atm
elementType: 8 8 8 7 7 6 6 6 6 6 6 6 6 6 6 6 6 6 6 6 6 6 6 1 1 1 1 1 1 1 1 1 1 1 1 1 1 1 1 1 1
symmnumber: 1
zpe: 846305.8 jmol-1
zpe.correction: 0.322341 hartree
zpe.thermalcorrener: 0.344076 hartree
zpe.thermalcorrenthalpy: 0.345020 hartree
zpe.thermalcorrgfe: 0.267176 hartree
zpe.sumelectzpe: -1030.258547 hartree
zpe.sumelectthermal: -1030.236812 hartree
zpe.sumelectthermalent: -1030.235868 hartree
zpe.sumelectthermalfe: -1030.313712 hartree
dipole: -0.9932 0.8077 -2.1195
dipole: 2.4761
quadrupole: -114.6554 -123.9901 -126.0978
quadrupole: 0.3153 -5.6771 -5.6143
quadrupole: 6.9257 -2.4090 -4.5167 0.3153 -5.6771 -5.6143
hfenergy: -1030.5808881 hartree
pointgroup: C01 [X(C18H18N2O3)]
dipole: 0.4739751 -0.3882679 -0.7573587 debye
polarizability: 268.7079413|21.8431502|192.2922317|-6.9894802|-30.184109|210.4236339 unknown
InChI: InChI=1S/C18H18N2O3/c1-11-8-9-12(2)13(10-11)16(23-18(21)19-3)17-20-14-6-4-5-7-15(14)22-17/h4-10,16,19H,1-3H3
charge 0 multiplicity 1
41 atoms
O  2.160025 0.372246 0.794641
O  -0.0608 -1.779366 -0.115443
O  -0.670018 -2.815851 1.927426
N  1.056017 1.055361 -1.125991
N  -0.359503 -4.028023 -0.064997
C  -0.169978 -0.435377 0.570698
C  -1.558003 0.152374 0.376414
C  -2.394583 0.415333 1.503544
C  0.957279 0.369649 -0.000767
C  -2.022374 0.407814 -0.936439
C  -3.317534 0.921241 -1.18082
C  -3.689254 0.932755 1.250503
C  -4.146589 1.18147 -0.061962
C  3.059607 1.149761 0.035537
C  2.380329 1.568803 -1.144642
C  -1.950507 0.155331 2.934556
C  -3.7928 1.190149 -2.598487
C  4.385439 1.488566 0.332071
C  3.046551 2.369225 -2.095859
C  5.042385 2.290927 -0.6310
C  4.386073 2.721896 -1.82037
C  -0.396734 -2.888272 0.70067
C  -0.641538 -5.352469 0.49401
H  0.038468 -0.606656 1.63959
H  -1.349474 0.211191 -1.777872
H  -4.350724 1.141218 2.099932
H  -5.155978 1.581899 -0.217818
H  -2.77043 0.377454 3.638451
H  -1.651496 -0.899944 3.075529
H  -1.089347 0.788258 3.223716
H  -3.129793 1.910824 -3.112862
H  -3.796869 0.264664 -3.204789
H  -4.815845 1.604432 -2.610208
H  4.882374 1.154434 1.246363
H  2.537808 2.699077 -3.005874
H  6.08206 2.587707 -0.456637
H  4.936966 3.342079 -2.535289
H  -0.130365 -3.918949 -1.053135
H  0.227356 -6.027511 0.384977
H  -1.519261 -5.815001 0.005876
H  -0.859842 -5.228121 1.566355
