program: Gaussian 09
title: 000190723
version: EM64L-G09RevD.01
frameworkgroup: C1[X(C15H13N3O2S)]
method: RPBEPBE
basis: SDD
operation: Freq
keyword: #p
keyword: freq=noraman
keyword: PBEPBE/SDD
title: #p freq=noraman PBEPBE/SDD
converged: YES YES NO NO
title: Mulliken charges:
elementType: S O O N N N C C C C C C C C C C C C C C C H H H H H H H H H H H H H
charge: 0.364453 -0.278407 -0.208568 -0.486252 -0.511682 -0.332029 0.335386 0.233247 -0.367792 -0.316943 0.527776 -0.255242 -0.249505 0.272122 -0.221141 -0.603092 -0.365988 0.381420 -0.199769 -0.387754 -0.535867 0.201733 0.296504 0.249043 0.290392 0.232749 0.238805 0.236050 0.307027 0.223920 0.241958 0.222094 0.243261 0.222093
chargesum: 0.00000
title: Mulliken charges with hydrogens summed into heavy atoms:
elementType: S O O N N N C C C C C C C C C C C C C C C
charge: 0.364453 -0.278407 -0.208568 -0.189748 -0.221290 -0.332029 0.335386 0.233247 -0.367792 -0.115211 0.527776 -0.006200 -0.016757 0.272122 0.014909 -0.364287 -0.058962 0.381420 0.024150 -0.145795 0.151582
polarizability: 3.62734266e+02 -1.36989056e+00 2.29007539e+02 1.72831639e-03 3.19416552e-03 8.39939415e+01
1716.lowfreq: -17.8260 -4.6514 -1.6757 -0.0011 -0.0008 0.0007 9.1956 27.0063 44.5483
frequency: -15.8357 26.8467 44.5338 49.5023 59.8360 98.4369 131.3257 138.2041 168.2905 191.5139 196.6036 230.2623 231.3922 261.4801 268.8684 278.9219 315.3938 366.6743 407.5984 418.1421 453.4611 457.3156 486.2595 490.9122 502.9683 524.1911 548.2188 580.9274 600.2668 622.1519 637.2670 676.3817 683.6371 689.4316 701.1053 722.4895 727.8751 768.5299 779.1835 781.2564 840.6435 848.3791 861.6733 889.1718 916.7171 938.2611 968.5540 983.3939 984.1922 985.1151 1020.0830 1024.4681 1040.7479 1093.4244 1112.1132 1113.3429 1138.8498 1153.6637 1165.7743 1167.6259 1178.9514 1198.4120 1259.0702 1276.0723 1303.7664 1319.1954 1387.1894 1394.4187 1416.1144 1419.3943 1438.1269 1441.7536 1466.0475 1473.7614 1476.3324 1491.2114 1508.4574 1527.9522 1577.0587 1596.8885 1599.0760 1625.7092 1672.8203 2960.6998 3048.7710 3107.3392 3123.7220 3134.3713 3139.6432 3140.3048 3156.1215 3171.2854 3171.9103 3205.3423 3524.3048 3545.6765
redmass: 5.9853 5.0061 6.0828 6.8054 4.3360 3.5809 5.6447 3.3719 8.5062 5.7481 1.5593 3.1671 4.3266 1.8799 5.6815 9.4396 4.8060 8.9979 1.8104 2.7912 5.4438 2.9024 10.1712 4.0368 7.6878 9.0560 5.0489 1.4247 9.2931 2.9947 4.8599 7.9134 6.5156 2.0460 10.9146 7.0449 2.0053 2.0837 7.0240 1.3546 6.7251 1.3883 1.7864 1.3886 6.0436 1.3820 7.7513 1.2968 6.8756 1.3300 3.7267 2.8926 3.9842 1.6218 2.8878 1.2590 1.5679 1.4621 2.1744 1.4162 1.1185 1.4474 1.6780 2.0819 2.0463 2.2836 5.5573 7.0117 2.7947 2.6945 1.2519 2.3277 1.0499 1.0603 3.4704 4.1558 1.9835 2.1079 5.8942 6.2973 5.0365 6.5976 4.8071 1.0328 1.1040 1.0889 1.0995 1.0915 1.0884 1.0872 1.0937 1.1002 1.0942 1.0950 1.0765 1.0758
irintensity: 0.0549 0.0741 0.8994 4.8978 2.9913 10.0891 2.1780 0.6239 0.1025 0.0012 0.3939 0.3385 3.4669 0.2772 7.2568 13.0192 0.3180 3.4041 0.7412 3.2586 0.9038 6.8388 2.9846 4.4195 37.9846 1.9957 31.9382 106.6356 4.4455 26.9664 20.8294 0.7013 6.5731 32.5511 13.3891 11.3133 67.9347 45.4095 2.8465 44.1235 3.8688 0.0879 61.7560 10.6920 0.3668 0.5567 30.4416 4.1328 7.4453 0.0643 32.0065 15.3389 5.9059 17.0130 7.0870 0.2441 12.8453 11.0167 556.9243 102.4067 9.9912 135.7707 6.0264 47.8314 56.4072 21.6551 312.2517 27.8624 53.5942 95.4976 10.4666 140.3266 13.0829 36.3583 864.5144 5.0846 448.8534 28.4721 4.9406 27.2373 81.6248 277.5102 115.3393 74.9684 49.2199 19.4875 26.7646 10.6499 9.7600 4.1924 14.1583 23.2780 11.5167 10.0141 5.2119 13.3967
temp: 298.150 k
press: 1.00000 atm
elementType: 16 8 8 7 7 7 6 6 6 6 6 6 6 6 6 6 6 6 6 6 6 1 1 1 1 1 1 1 1 1 1 1 1 1
symmnumber: 1
zpe: 664173.4 jmol-1
zpe.correction: 0.252970 hartree
zpe.thermalcorrener: 0.270846 hartree
zpe.thermalcorrenthalpy: 0.271790 hartree
zpe.thermalcorrgfe: 0.205861 hartree
zpe.sumelectzpe: -1290.672458 hartree
zpe.sumelectthermal: -1290.654582 hartree
zpe.sumelectthermalent: -1290.653638 hartree
zpe.sumelectthermalfe: -1290.719567 hartree
dipole: 0.6404 6.2823 0.0002
dipole: 6.3149
quadrupole: -82.4103 -127.8152 -136.3396
quadrupole: -11.4552 0.0031 -0.0034
quadrupole: 33.1114 -12.2935 -20.8179 -11.4552 0.0031 -0.0034
hfenergy: -1290.9254278 hartree
pointgroup: C01 [X(C15H13N3O2S1)]
dipole: -0.1527383 -2.4797702 0.0000919 debye
polarizability: 362.6293971|3.9861474|229.1124079|-0.001599|-0.0032608|83.9939415 unknown
InChI: InChI=1S/C15H13N3O2S/c1-20-11-6-4-5-10(9-11)16-15(19)17-14-12-7-2-3-8-13(12)21-18-14/h2-9,16-17H,1H3
charge 0 multiplicity 1
34 atoms
S  4.402483 2.204752 0.000222
O  -5.729684 -1.812996 0.000761
O  -0.249754 2.011234 -0.0010
N  1.075943 0.053922 -0.001167
N  -1.24756 -0.130975 -0.00088
N  2.589613 1.93059 -0.000374
C  3.530239 -0.301734 -0.000475
C  2.369768 0.604293 -0.00067
C  4.753151 0.432223 0.000014
C  3.572774 -1.72047 -0.000697
C  -2.634634 0.196196 -0.000559
C  6.0059 -0.218218 0.000275
C  4.817482 -2.376398 -0.000439
C  -0.158757 0.760544 -0.001374
C  6.027371 -1.628079 0.000044
C  -3.542837 -0.890038 -0.000047
C  -3.123418 1.53235 -0.000749
C  -4.935567 -0.653306 0.000268
C  -4.516272 1.740163 -0.000429
C  -5.440515 0.670255 0.000078
C  -7.182914 -1.633285 0.001137
H  2.653268 -2.320227 -0.001061
H  1.048846 -0.966737 -0.001445
H  6.939398 0.352851 0.000649
H  -1.052111 -1.134166 -0.000555
H  4.856987 -3.470455 -0.000608
H  -3.196321 -1.930362 0.000108
H  6.988451 -2.153291 0.00024
H  -2.422823 2.367502 -0.00112
H  -4.894602 2.768531 -0.000575
H  -6.514709 0.873187 0.000315
H  -7.521888 -1.091846 0.905703
H  -7.598295 -2.651799 0.001518
H  -7.522413 -1.09231 -0.90351
