program: Gaussian 09
title: 000190722
version: EM64L-G09RevD.01
frameworkgroup: C1[X(C14H10ClN3OS)]
method: RPBEPBE
basis: SDD
operation: Freq
keyword: #p
keyword: freq=noraman
keyword: PBEPBE/SDD
title: #p freq=noraman PBEPBE/SDD
converged: YES YES NO NO
title: Mulliken charges:
elementType: Cl S O N N N C C C C C C C C C C C C C C H H H H H H H H H H
charge: -0.062744 0.370070 -0.209494 -0.484388 -0.510379 -0.332473 0.336275 0.232645 -0.367626 -0.316411 -0.254640 0.506345 -0.248874 -0.220402 0.277170 -0.441955 -0.317811 -0.185256 -0.200098 -0.120437 0.200466 0.297144 0.250088 0.233563 0.237268 0.289050 0.219961 0.312510 0.254617 0.255813
chargesum: 0.00000
title: Mulliken charges with hydrogens summed into heavy atoms:
elementType: Cl S O N N N C C C C C C C C C C C C C C
charge: -0.062744 0.370070 -0.209494 -0.187244 -0.221329 -0.332473 0.336275 0.232645 -0.367626 -0.115945 -0.004551 0.506345 -0.015311 0.016866 0.277170 -0.221994 -0.005301 0.069361 0.055716 -0.120437
polarizability: 3.69465782e+02 -5.30666230e+00 2.12521765e+02 -5.69440442e-03 -4.28191191e-02 7.46228598e+01
1716.lowfreq: -23.9919 -12.1636 -1.7741 -0.0014 -0.0008 0.0008 1.8197 22.8542 45.8420
frequency: -23.9548 22.8297 45.8363 52.6151 59.5671 126.3642 132.1844 137.6823 174.5836 191.5206 239.0400 267.0191 278.7225 310.6985 355.5195 368.2180 401.5484 410.1023 414.4631 419.4694 487.9777 488.8105 511.6558 523.0691 541.5385 590.9121 618.6617 633.7085 637.2432 683.5200 694.7073 698.6431 703.3778 728.3997 746.6165 768.8416 808.2161 812.6186 844.6475 849.2359 895.7716 931.5741 939.1392 971.9031 978.6544 985.7873 992.0612 1024.1160 1036.1551 1074.3026 1109.7659 1117.2925 1140.4085 1167.9559 1179.4284 1184.8044 1258.1519 1265.0472 1292.6892 1313.8761 1362.4469 1394.9894 1401.6735 1419.4439 1442.0999 1474.9853 1486.9157 1502.0903 1516.5128 1577.4819 1596.1690 1597.5664 1608.4680 1671.3900 3107.3730 3113.5534 3141.0114 3157.1391 3166.0410 3171.9618 3172.9752 3198.9902 3521.5109 3546.1343
redmass: 4.8923 9.5336 8.5094 5.8983 5.8652 7.7986 5.3154 3.2478 12.2502 6.0754 8.3244 4.6091 10.2860 4.1657 5.7271 8.8806 9.8935 2.9772 2.1523 2.5052 9.1738 3.9487 2.6799 9.5783 8.9689 1.2234 7.7667 8.6947 4.8989 6.5858 7.9287 5.3924 5.2694 1.9931 7.1132 2.0968 1.4108 6.5792 1.4091 1.3844 6.7716 1.3581 1.3807 8.5610 1.3176 1.3307 4.2217 2.5868 5.3101 2.6547 2.7205 1.4579 1.5963 2.2012 1.1260 1.1131 1.8618 2.0193 1.3595 2.5882 4.9378 7.0461 4.4212 2.7285 2.4942 3.0636 3.2763 2.2982 2.0563 5.8483 5.5139 6.1643 6.2816 4.7471 1.0889 1.0904 1.0873 1.0937 1.0913 1.1002 1.0950 1.0951 1.0766 1.0758
irintensity: 1.2706 0.0606 0.1724 3.8139 3.2274 1.7528 0.6970 0.5446 0.9170 0.0050 0.1691 5.3597 5.9665 0.5167 0.9374 12.1449 36.5309 0.0033 4.3002 0.9579 0.0111 0.1397 50.5732 12.5068 9.8188 120.6009 15.3055 15.7862 19.1818 7.8393 3.0271 14.5694 5.2324 67.5458 11.7008 43.5705 42.8358 3.7080 61.6885 0.0014 0.5547 0.8480 0.6126 5.3864 3.0369 0.0809 33.0459 9.9835 6.4527 64.0830 15.9446 17.1635 38.6389 416.8742 34.6958 0.4075 9.9483 78.8447 38.4357 2.4078 207.5960 29.5082 9.1792 93.3741 134.9308 681.0167 270.2276 621.7984 67.1194 6.9998 36.5856 18.0093 22.3246 121.7276 20.6702 18.3194 4.0735 13.6481 2.3831 21.3432 2.9558 9.8106 4.8644 15.4716
temp: 298.150 k
press: 1.00000 atm
elementType: 17 16 8 7 7 7 6 6 6 6 6 6 6 6 6 6 6 6 6 6 1 1 1 1 1 1 1 1 1 1
symmnumber: 1
zpe: 556192.9 jmol-1
zpe.correction: 0.211843 hartree
zpe.thermalcorrener: 0.228321 hartree
zpe.thermalcorrenthalpy: 0.229265 hartree
zpe.thermalcorrgfe: 0.165850 hartree
zpe.sumelectzpe: -1635.710271 hartree
zpe.sumelectthermal: -1635.693793 hartree
zpe.sumelectthermalent: -1635.692849 hartree
zpe.sumelectthermalfe: -1635.756264 hartree
dipole: -4.3386 7.0604 -0.0042
dipole: 8.2869
quadrupole: -125.2328 -120.6366 -136.3570
quadrupole: -6.1927 -0.0219 -0.0244
quadrupole: 2.1760 6.7722 -8.9482 -6.1927 -0.0219 -0.0244
hfenergy: -1635.9221139 hartree
pointgroup: C01 [X(C14H10Cl1N3O1S1)]
dipole: 1.8098922 -2.7118033 -0.0002248 debye
polarizability: 369.6427874|0.5898952|212.3447481|-0.0516622|-0.0471096|74.6228714 unknown
InChI: InChI=1S/C14H10ClN3OS/c15-9-5-7-10(8-6-9)16-14(19)17-13-11-3-1-2-4-12(11)20-18-13/h1-8,16-17H
charge 0 multiplicity 1
30 atoms
Cl -7.536833 -0.088181 0.00258
S  3.857721 2.400823 -0.004138
O  -0.747365 1.681777 0.000434
N  0.795087 -0.110249 -0.001691
N  -1.49265 -0.558711 -0.001873
N  2.089213 1.92447 -0.003981
C  3.273645 -0.187854 -0.000692
C  2.0200 0.582526 -0.002117
C  4.406387 0.67872 -0.001637
C  3.474698 -1.592964 0.001454
C  5.724175 0.172777 -0.00055
C  -2.904654 -0.3832 -0.000753
C  4.78496 -2.105136 0.002526
C  5.903314 -1.22579 0.001514
C  -0.508726 0.450569 -0.001025
C  -3.703916 -1.559141 -0.002115
C  -3.53573 0.890365 0.001646
C  -5.11041 -1.476218 -0.001115
C  -4.944652 0.972476 0.002659
C  -5.715208 -0.204775 0.001276
H  2.628261 -2.292227 0.002399
H  0.88458 -1.127349 -0.001535
H  6.58798 0.844642 -0.001273
H  4.946975 -3.187799 0.004192
H  6.917198 -1.63979 0.002378
H  -1.186673 -1.533964 -0.003664
H  -3.229724 -2.549141 -0.003986
H  -2.926453 1.79539 0.002666
H  -5.720486 -2.383654 -0.002187
H  -5.432012 1.951705 0.004507
