program: Gaussian 09
title: 000190702
version: EM64L-G09RevD.01
frameworkgroup: C1[X(C13H6Cl6O2S)]
method: RPBEPBE
basis: SDD
operation: Freq
keyword: #p
keyword: freq=noraman
keyword: PBEPBE/SDD
title: #p freq=noraman PBEPBE/SDD
converged: YES YES NO NO
title: Mulliken charges:
elementType: Cl Cl Cl Cl Cl Cl S O O C C C C C C C C C C C C C H H H H H H
charge: 0.051199 0.051277 0.057126 0.035458 -0.016816 0.012358 0.921875 -0.515036 -0.543413 -0.042347 0.458547 -0.375888 0.518786 -0.158327 -0.298817 -0.036191 -0.728401 -0.247185 -0.312620 -0.113023 -0.219691 -0.214102 0.330045 0.271693 0.277474 0.297204 0.269437 0.269379
chargesum: 0.00000
title: Mulliken charges with hydrogens summed into heavy atoms:
elementType: Cl Cl Cl Cl Cl Cl S O O C C C C C C C C C C C C C
charge: 0.051199 0.051277 0.057126 0.035458 -0.016816 0.012358 0.921875 -0.515036 -0.543413 -0.042347 0.458547 -0.045843 0.518786 -0.158327 -0.298817 -0.036191 0.117970 -0.247185 -0.312620 -0.113023 0.049746 0.055277
polarizability: 3.03736216e+02 -3.21526319e+00 2.06558896e+02 -1.89721491e-01 -2.09634636e+00 1.96598233e+02
1716.lowfreq: -7.4756 -5.8422 -0.7099 -0.0016 -0.0007 0.0003 9.7632 30.4518 38.7628
frequency: 9.4252 30.4230 38.7601 49.3905 56.3189 79.8498 81.0387 95.1742 112.9398 128.7142 141.3762 149.8677 188.5285 193.3176 196.8394 209.4391 213.1635 228.9155 248.7217 260.5590 272.0602 277.9987 303.9869 312.5982 322.6390 331.4912 369.4564 381.1469 418.5622 456.0356 472.1727 511.9797 529.1998 538.3572 554.8821 557.6289 588.7678 607.9053 653.8292 698.6429 740.9550 761.5552 767.3174 771.1147 798.2908 810.1330 844.7658 895.7716 938.1210 946.1017 978.3184 1001.2320 1016.5531 1054.3216 1111.8119 1134.2265 1150.1801 1165.7840 1248.3664 1304.1044 1312.0571 1345.8082 1353.4599 1359.9812 1399.0136 1409.4057 1421.2645 1443.3153 1530.1332 1551.2266 1573.7918 1589.5014 3031.6560 3130.5697 3169.5330 3179.9145 3187.9451 3189.7281
redmass: 17.2401 13.9958 12.9017 9.2002 9.5680 22.1197 20.2505 9.1337 12.2120 3.7827 2.1321 2.1587 10.1124 29.7241 16.5293 24.8017 9.0975 10.8906 8.3784 7.3634 7.1481 7.3365 7.1348 22.7766 9.9594 27.1548 9.6069 10.1502 12.7618 6.3963 5.9596 9.9028 7.0802 5.2731 9.6836 9.7721 8.3387 5.9864 10.1857 10.0575 8.6456 8.7547 8.8419 7.8962 12.4338 1.3462 9.3879 3.1303 1.4020 1.3465 1.3935 6.9329 1.8783 8.8001 7.3561 1.8529 1.6121 1.8864 2.8053 1.1700 6.1970 10.2986 9.7263 3.4652 3.0429 1.0552 1.0548 4.9768 9.3953 7.4140 8.8866 9.4209 1.0245 1.0920 1.0891 1.1071 1.0979 1.1082
irintensity: 0.0967 1.1051 0.3596 2.3645 2.7434 0.2477 0.1370 1.1523 0.2070 4.8418 2.4688 0.7206 1.3534 0.0170 0.5545 0.0260 0.5837 0.0356 0.1594 2.6514 2.2209 0.9032 0.2241 1.2478 17.4719 1.2316 7.8016 86.6239 13.4368 7.1475 2.8005 10.2304 11.3617 6.6444 2.4025 8.0849 45.2005 4.8910 1.3310 16.1487 28.0167 21.1687 13.4844 26.0292 55.2669 41.5087 59.3939 30.7848 6.1512 0.0220 60.8262 23.0900 45.3754 30.8517 25.1514 26.6424 7.8759 44.0084 25.9803 10.1075 53.3996 7.4632 24.6148 80.4105 133.6998 10.2964 15.4765 11.9047 7.8298 11.4963 1.9350 1.2043 0.4059 26.0256 0.0476 0.1089 0.1697 0.6341
temp: 298.150 k
press: 1.00000 atm
elementType: 17 17 17 17 17 17 16 8 8 6 6 6 6 6 6 6 6 6 6 6 6 6 1 1 1 1 1 1
symmnumber: 1
zpe: 403676.5 jmol-1
zpe.correction: 0.153752 hartree
zpe.thermalcorrener: 0.176744 hartree
zpe.thermalcorrenthalpy: 0.177688 hartree
zpe.thermalcorrgfe: 0.097887 hartree
zpe.sumelectzpe: -3806.093272 hartree
zpe.sumelectthermal: -3806.070280 hartree
zpe.sumelectthermalent: -3806.069336 hartree
zpe.sumelectthermalfe: -3806.149137 hartree
dipole: 1.3538 1.7008 5.1530
dipole: 5.5928
quadrupole: -157.4517 -190.3537 -176.2794
quadrupole: -4.9978 -6.7595 -9.8756
quadrupole: 17.2432 -15.6588 -1.5845 -4.9978 -6.7595 -9.8756
hfenergy: -3806.247024 hartree
pointgroup: C01 [X(C13H6Cl6O2S1)]
dipole: -0.6923421 -0.541325 2.0172388 debye
polarizability: 302.7700651|-7.2728625|207.1766749|7.5740976|1.0708907|196.9466047 unknown
InChI: InChI=1S/C13H6Cl6O2S/c1-22(20,21)8-4-5(10(16)13(19)12(8)18)9-6(14)2-3-7(15)11(9)17/h2-4H,1H3
charge 0 multiplicity 1
28 atoms
Cl 4.260468 -1.369366 -0.313182
Cl -1.063232 -2.996236 0.012393
Cl 2.059497 -3.724881 -0.28562
Cl -1.786267 0.124348 -2.514989
Cl -1.329309 -0.184271 3.029002
Cl -4.92202 0.942792 -2.169175
S  3.234066 1.897991 -0.122773
O  4.188162 1.81213 -1.436428
O  2.219423 3.163393 0.095402
C  2.067232 0.35544 -0.029649
C  -0.261867 -0.339771 0.117513
C  0.712518 0.68271 0.101468
C  -1.708546 0.013577 0.264258
C  2.506013 -0.971667 -0.152231
C  0.16996 -1.683056 -0.004531
C  1.542413 -2.009641 -0.138376
C  4.32456 1.780423 1.443062
C  -2.522231 0.267225 -0.872562
C  -2.317615 0.13271 1.536848
C  -3.881698 0.620478 -0.728757
C  -3.670572 0.48385 1.698062
C  -4.455938 0.729032 0.553826
H  0.433106 1.74058 0.179061
H  3.639354 1.758936 2.301287
H  4.930359 0.870149 1.346068
H  4.933045 2.695488 1.420465
H  -4.105722 0.564895 2.697081
H  -5.509357 1.003944 0.653975
