program: Gaussian 09
title: 000190694
version: EM64L-G09RevD.01
frameworkgroup: C1[X(C13H8Cl4O2S)]
method: RPBEPBE
basis: SDD
operation: Freq
keyword: #p
keyword: freq=noraman
keyword: PBEPBE/SDD
title: #p freq=noraman PBEPBE/SDD
converged: YES YES NO NO
title: Mulliken charges:
elementType: Cl Cl Cl Cl S O O C C C C C C C C C C C C C H H H H H H H H
charge: -0.001603 0.000633 0.013206 -0.003487 0.925948 -0.519692 -0.546995 -0.037954 0.454393 0.436026 -0.141452 -0.216277 -0.363589 -0.321063 -0.729270 -0.303895 -0.358210 -0.093509 -0.212208 -0.230343 0.335035 0.293150 0.278095 0.295975 0.270972 0.264666 0.245283 0.266166
chargesum: 0.00000
title: Mulliken charges with hydrogens summed into heavy atoms:
elementType: Cl Cl Cl Cl S O O C C C C C C C C C C C C C
charge: -0.001603 0.000633 0.013206 -0.003487 0.925948 -0.519692 -0.546995 -0.037954 0.454393 0.436026 -0.141452 0.118758 -0.363589 -0.027914 0.115772 -0.303895 -0.093544 -0.093509 0.033075 0.035823
polarizability: 3.00566334e+02 1.63594112e+01 2.01471406e+02 8.27562196e+00 9.95201674e+00 1.46844427e+02
1716.lowfreq: -3.7240 -1.5732 0.0018 0.0020 0.0021 5.6243 20.5431 30.6535 42.7417
frequency: 20.5267 30.6407 42.7400 54.7794 74.6491 101.0043 114.4776 124.8448 154.2940 157.7914 169.3921 196.7689 202.9917 208.5226 214.0380 233.3316 250.6843 276.6936 310.5960 314.2975 327.3562 342.2903 391.1587 405.0761 444.3958 449.5120 452.9740 494.8285 505.2007 534.6576 576.3610 593.5894 642.0128 644.1800 706.1852 715.2972 724.3671 733.5318 791.8243 795.6894 830.2863 891.5033 894.5887 910.3917 927.5219 977.5853 978.6990 995.4445 1015.5505 1025.6403 1067.6785 1093.8187 1113.2906 1153.9788 1200.2270 1234.8465 1261.9171 1304.1455 1330.5731 1352.4458 1361.6442 1401.1069 1409.7449 1421.3769 1423.5362 1460.2473 1551.3718 1561.2731 1578.2840 1596.3672 3031.1132 3133.2249 3151.2315 3166.3340 3168.8862 3180.0226 3181.4984 3188.4376
redmass: 11.5328 9.4987 14.2730 7.0389 16.0972 9.6412 5.6470 9.9770 2.6257 1.4896 14.0287 21.7265 6.1167 8.0339 5.8678 5.9155 5.3248 6.8477 17.6867 11.8049 11.5456 8.0940 10.3709 8.3779 6.5871 3.9950 9.6792 5.3448 4.0836 8.6811 8.2893 6.0383 9.1691 7.8628 7.4274 5.6741 3.9820 3.4722 1.7996 6.0747 7.6190 1.5087 3.1739 1.3852 1.3466 1.5096 1.3439 4.7598 1.8434 6.9211 3.7628 2.0244 2.0328 1.6954 1.4033 1.2295 2.9409 1.1402 4.1874 9.9749 9.9943 3.0024 1.0545 2.1638 1.0893 3.6442 8.7428 7.0863 7.7916 7.4800 1.0245 1.0920 1.0872 1.0930 1.0930 1.1071 1.0997 1.1082
irintensity: 2.1477 2.0649 0.3632 3.3217 0.0228 0.0201 5.4279 2.2436 0.1814 0.3078 0.4079 0.0684 0.1962 2.4325 1.4887 0.3099 2.0422 0.5946 5.2795 9.0327 20.0032 6.4724 20.8250 44.6721 17.0931 4.2176 14.4232 9.6602 1.6579 25.6629 26.7545 7.2864 21.0342 12.7485 9.6899 24.0377 25.0915 19.4592 56.0715 60.2326 8.0704 4.1369 30.0215 0.7440 18.5226 44.7080 0.2788 80.9169 35.2129 39.2510 19.9518 43.2996 4.2317 17.5471 7.7451 2.0904 21.3193 7.6200 62.0516 1.4648 3.0390 60.7739 9.7337 90.8019 3.3361 12.8265 17.2137 6.3392 8.5043 2.2737 0.3832 32.7344 3.6337 2.7608 0.5502 0.1178 5.3864 0.6898
temp: 298.150 k
press: 1.00000 atm
elementType: 17 17 17 17 16 8 8 6 6 6 6 6 6 6 6 6 6 6 6 6 1 1 1 1 1 1 1 1
symmnumber: 1
zpe: 454876.3 jmol-1
zpe.correction: 0.173253 hartree
zpe.thermalcorrener: 0.193499 hartree
zpe.thermalcorrenthalpy: 0.194443 hartree
zpe.thermalcorrgfe: 0.122023 hartree
zpe.sumelectzpe: -2887.329706 hartree
zpe.sumelectthermal: -2887.309461 hartree
zpe.sumelectthermalent: -2887.308516 hartree
zpe.sumelectthermalfe: -2887.380937 hartree
dipole: 3.7267 -1.3498 -0.3961
dipole: 3.9833
quadrupole: -163.4218 -151.8322 -149.7208
quadrupole: 21.2170 24.5020 8.0601
quadrupole: -8.4301 3.1594 5.2708 21.2170 24.5020 8.0601
hfenergy: -2887.5029592 hartree
pointgroup: C01 [X(C13H8Cl4O2S1)]
dipole: -1.4403265 0.4774844 -0.3917793 debye
polarizability: 302.01349|10.8119863|187.7561073|-8.1644966|-24.6578822|159.1125703 unknown
InChI: InChI=1S/C13H8Cl4O2S/c1-20(18,19)12-6-10(15)8(5-11(12)16)7-3-2-4-9(14)13(7)17/h2-6H,1H3
charge 0 multiplicity 1
28 atoms
Cl 2.524217 2.797225 0.097488
Cl -0.506149 -2.879069 0.113123
Cl -2.097782 1.182724 -2.085567
Cl -5.296215 1.282149 -1.53553
S  4.318753 -0.168107 -0.040701
O  4.983372 0.688318 1.172771
O  4.589467 -1.776706 -0.179141
C  2.396647 -0.022603 0.020499
C  -0.4230 -0.068412 0.251345
C  -1.908689 -0.051719 0.425834
C  1.688618 1.185037 0.121968
C  1.731942 -1.257956 0.028695
C  0.329341 -1.266526 0.143921
C  0.286997 1.160905 0.234321
C  4.814802 0.633667 -1.70386
C  -2.777849 0.524545 -0.537841
C  -2.476988 -0.593201 1.607884
C  -4.172634 0.557514 -0.314744
C  -3.868295 -0.556237 1.827776
C  -4.724199 0.022608 0.866424
H  2.322893 -2.178735 -0.048506
H  -0.266384 2.100968 0.311244
H  4.523726 1.690946 -1.649899
H  5.904284 0.499052 -1.758124
H  4.288151 0.076192 -2.490216
H  -1.813219 -1.039719 2.354222
H  -4.290663 -0.975086 2.745969
H  -5.806246 0.059725 1.021139
