program: Gaussian 09
title: 000190687
version: EM64L-G09RevD.01
frameworkgroup: C1[X(C13H9Cl3O2S)]
method: RPBEPBE
basis: SDD
operation: Freq
keyword: #p
keyword: freq=noraman
keyword: PBEPBE/SDD
title: #p freq=noraman PBEPBE/SDD
converged: YES YES NO NO
title: Mulliken charges:
elementType: Cl Cl Cl S O O C C C C C C C C C C C C C H H H H H H H H H
charge: 0.013522 -0.022315 -0.038171 0.915920 -0.522618 -0.546348 -0.023751 0.479097 -0.387439 0.398959 -0.240156 -0.341269 -0.097246 -0.729758 -0.326481 -0.336030 -0.224370 -0.228935 -0.219995 0.337219 0.289539 0.277806 0.295741 0.271004 0.262891 0.260878 0.240901 0.241403
chargesum: 0.00000
title: Mulliken charges with hydrogens summed into heavy atoms:
elementType: Cl Cl Cl S O O C C C C C C C C C C C C C
charge: 0.013522 -0.022315 -0.038171 0.915920 -0.522618 -0.546348 -0.023751 0.479097 -0.387439 0.398959 0.097064 -0.051729 -0.097246 0.114793 -0.326481 -0.073139 0.036508 0.011967 0.021407
polarizability: 2.51238848e+02 1.57142259e+01 2.17350467e+02 7.47864689e+00 1.31817781e+01 1.40907470e+02
1716.lowfreq: -4.6743 -0.0019 0.0010 0.0022 5.4046 7.5402 23.7058 38.4203 55.3993
frequency: 23.6516 38.3714 55.3942 58.3409 80.2210 110.1683 120.1187 140.0692 144.2735 169.9716 173.2379 208.8385 211.7614 238.4338 249.5008 274.9651 294.3739 310.6362 315.7631 341.7080 374.6235 393.3512 415.2185 432.0096 473.3423 524.0957 538.8749 574.5782 578.5758 599.2351 620.7225 669.9659 725.2326 729.8842 741.8039 766.4030 796.5681 802.3316 870.2246 893.9342 901.7216 928.7283 955.0281 974.4712 988.8970 991.5763 1013.4669 1020.5060 1034.1770 1083.5385 1108.4376 1127.1153 1168.8890 1176.0376 1250.6007 1282.7109 1302.4295 1345.7074 1363.0062 1370.8110 1409.4001 1415.2030 1420.6766 1422.4119 1474.6327 1543.6013 1570.1620 1586.4514 1605.9374 3031.6226 3136.5041 3141.2940 3151.9519 3167.0259 3173.8214 3179.3820 3179.9045 3189.9416
redmass: 10.3421 9.5427 6.4075 6.4058 13.5027 5.3752 5.8947 1.1635 5.9167 6.7284 11.2180 6.9765 9.4200 5.4311 5.6435 5.2810 7.9524 17.8891 9.8070 8.3024 6.4355 8.5784 9.6403 3.9698 4.3446 7.4278 5.9518 5.1848 4.8703 6.9041 7.2983 7.4343 4.8164 7.0648 3.6505 1.3523 12.2586 8.1102 1.3556 3.1617 1.5009 1.3254 1.3733 1.7561 3.0018 1.3540 1.9387 6.1387 2.9138 3.4000 1.6246 1.6275 2.0924 1.0602 1.5753 1.7214 1.1382 5.3578 9.0358 3.6390 1.0892 2.6621 1.0732 2.3891 3.1431 7.5224 6.2145 8.2218 7.2164 1.0245 1.0924 1.0861 1.0910 1.0955 1.0933 1.1001 1.1071 1.1082
irintensity: 1.0015 2.3026 3.2715 0.3402 0.1951 2.1065 4.3561 0.6037 0.2165 1.4340 0.0549 1.3011 2.1602 0.7805 1.8192 1.6631 0.9087 4.0572 10.5528 15.0216 8.8615 65.8697 12.6611 8.2320 5.0502 25.5479 7.6171 13.3212 6.6732 30.8464 3.7725 16.9420 7.7173 4.9974 1.9719 80.8408 64.9252 22.0924 0.5062 26.0998 13.0510 12.1378 0.6260 43.3258 83.4219 1.6668 44.6188 21.5752 11.9679 12.3627 44.8305 1.1553 28.5323 0.8519 8.3095 1.5266 5.9119 39.3944 1.1631 14.5079 23.8290 85.0676 9.8958 33.4334 10.7887 24.9731 9.0736 11.8863 5.2821 0.3614 35.2794 0.4271 9.0464 8.0868 0.2997 11.5278 0.1216 0.6688
temp: 298.150 k
press: 1.00000 atm
elementType: 17 17 17 16 8 8 6 6 6 6 6 6 6 6 6 6 6 6 6 1 1 1 1 1 1 1 1 1
symmnumber: 1
zpe: 480112.6 jmol-1
zpe.correction: 0.182865 hartree
zpe.thermalcorrener: 0.201843 hartree
zpe.thermalcorrenthalpy: 0.202787 hartree
zpe.thermalcorrgfe: 0.133775 hartree
zpe.sumelectzpe: -2427.946080 hartree
zpe.sumelectthermal: -2427.927102 hartree
zpe.sumelectthermalent: -2427.926158 hartree
zpe.sumelectthermalfe: -2427.995170 hartree
dipole: -5.3776 -1.1158 2.1144
dipole: 5.8851
quadrupole: -140.9895 -142.4526 -134.9472
quadrupole: 4.9418 18.3858 -4.9224
quadrupole: -1.5264 -2.9895 4.5159 4.9418 18.3858 -4.9224
hfenergy: -2428.128945 hartree
pointgroup: C01 [X(C13H9Cl3O2S1)]
dipole: -2.0959757 -0.4556552 0.8718777 debye
polarizability: 254.4521889|12.1870641|205.5446316|5.0961393|27.1717715|149.4999646 unknown
InChI: InChI=1S/C13H9Cl3O2S/c1-19(17,18)12-7-8(14)6-10(13(12)16)9-4-2-3-5-11(9)15/h2-7H,1H3
charge 0 multiplicity 1
28 atoms
Cl 0.224396 -2.200939 -0.196201
Cl 1.474095 4.088169 0.337923
Cl -2.367319 1.000224 2.506862
S  3.452118 -1.070056 -0.270829
O  3.288367 -2.013645 -1.586347
O  4.708669 -0.028274 -0.14277
C  1.888021 0.051502 -0.052929
C  -0.517296 0.502193 -0.023134
C  0.564514 -0.415871 -0.100312
C  -1.947756 0.079083 -0.12712
C  2.202708 1.412915 0.073796
C  -0.207955 1.881641 0.113357
C  1.127762 2.315252 0.164628
C  3.494253 -2.177981 1.286933
C  -2.891968 0.280819 0.909456
C  -2.419618 -0.514915 -1.329885
C  -4.246742 -0.081203 0.776732
C  -3.77146 -0.882169 -1.485779
C  -4.688041 -0.663829 -0.431703
H  3.254569 1.722999 0.086606
H  -1.024704 2.605739 0.174192
H  2.595468 -2.807434 1.260246
H  4.420984 -2.759602 1.181926
H  3.525553 -1.500407 2.150901
H  -1.708461 -0.680174 -2.145847
H  -4.93921 0.086604 1.606251
H  -4.107145 -1.333915 -2.424498
H  -5.740199 -0.945826 -0.542058
