program: Gaussian 09
title: 000190669
version: EM64L-G09RevD.01
frameworkgroup: C1[X(C16H14N2O3)]
method: RPBEPBE
basis: SDD
operation: Freq
keyword: #p
keyword: freq=noraman
keyword: PBEPBE/SDD
title: #p freq=noraman PBEPBE/SDD
converged: YES YES NO NO
title: Mulliken charges:
elementType: O O O N N C C C C C C C C C C C C C C C C H H H H H H H H H H H H H H
charge: -0.245956 -0.301699 -0.301538 -0.053294 -0.374691 -0.314995 0.188823 0.465795 0.234754 0.049291 -0.405727 -0.368798 -0.367379 -0.346384 -0.235838 -0.239431 -0.211233 -0.220200 -0.236843 0.340391 -0.607441 0.281267 0.262214 0.288779 0.256995 0.255946 0.227373 0.225578 0.232877 0.231550 0.228127 0.330900 0.229831 0.230189 0.270767
chargesum: 0.00000
title: Mulliken charges with hydrogens summed into heavy atoms:
elementType: O O O N N C C C C C C C C C C C C C C C C
charge: -0.245956 -0.301699 -0.301538 -0.053294 -0.043791 -0.033728 0.188823 0.465795 0.234754 0.049291 -0.143513 -0.080019 -0.110384 -0.090438 -0.008464 -0.013853 0.021644 0.011350 -0.008716 0.340391 0.123347
polarizability: 2.64123613e+02 -1.27315050e+01 1.86182213e+02 1.59911602e+01 2.53459743e+01 1.45632296e+02
1716.lowfreq: -5.5126 -1.8606 -0.0008 -0.0006 0.0004 4.9974 19.7701 27.9505 37.8456
frequency: 19.6242 27.8807 37.8230 47.5744 55.8036 78.8650 99.3087 123.1770 149.5748 175.6644 201.7955 219.1701 252.1127 255.2601 271.6849 319.5966 344.0227 404.5810 429.6049 443.2187 472.6929 533.9340 559.8904 576.1007 583.8557 610.6943 614.1400 617.8583 647.7303 692.9185 701.2961 707.8564 753.9313 754.3822 766.3769 773.0150 812.2315 851.2978 855.2153 861.4168 863.6451 872.3836 885.2081 917.0654 943.1023 944.8315 982.9887 985.1019 993.3069 1002.0051 1002.1868 1029.6000 1067.2450 1084.4386 1087.7493 1103.2954 1125.6960 1145.0443 1156.2400 1173.0505 1174.6195 1196.4737 1200.6921 1206.7071 1233.6279 1281.2419 1294.6317 1324.0907 1363.4321 1391.9050 1402.8133 1429.2522 1433.3086 1448.8621 1460.7495 1461.2118 1483.5794 1485.2408 1516.1063 1546.4110 1592.8922 1611.0819 1614.3513 1621.2398 1677.6716 2980.5009 3043.1352 3058.3045 3114.4154 3123.5981 3133.3338 3140.3712 3145.1060 3157.5288 3158.6854 3168.7248 3175.2438 3182.8615 3575.6797
redmass: 5.1299 4.5209 4.3535 4.9254 4.3000 5.0579 1.1805 4.5662 3.9960 5.0116 6.3588 5.7270 5.4951 6.1869 5.6697 5.4986 5.7217 2.8372 3.2741 5.6025 4.4729 6.8954 4.8068 3.8373 1.1187 6.8941 6.6909 6.6429 6.3882 11.1570 4.6756 1.9535 2.0924 4.6790 2.0193 2.1624 5.7129 5.2377 5.7807 1.2748 1.4273 7.2371 6.4984 6.3582 1.4809 1.3809 1.3084 1.8214 2.9372 1.5465 1.6973 2.3065 3.8314 3.7654 1.8983 1.8165 1.2805 1.6453 1.2863 1.3243 1.6742 1.1931 2.1225 2.2282 2.8496 1.4771 1.2767 1.4990 1.9474 4.2733 3.9391 1.1627 3.0050 2.0925 2.6095 1.3280 1.0442 2.2656 1.4066 10.0605 5.9846 7.8866 5.9113 7.9690 9.0123 1.0353 1.0837 1.1027 1.0982 1.0849 1.0889 1.0864 1.0939 1.0915 1.0973 1.0992 1.0961 1.0990 1.0773
irintensity: 0.6050 0.2154 0.1947 1.0240 7.7772 2.5515 0.5485 2.0068 3.6446 1.3383 1.3192 1.8701 2.5610 0.4217 5.8915 20.9587 6.5886 0.4218 3.5791 7.6030 4.4460 3.5566 12.4800 0.6996 128.5714 0.7751 3.6697 3.8925 6.0642 20.3579 9.4234 59.6138 33.4697 30.2079 45.7634 74.0561 17.1553 35.0949 22.8151 3.0319 0.8405 33.2776 99.4075 213.7511 2.5741 4.6611 0.0023 0.1980 1.0091 6.4469 5.8689 3.1535 62.6879 196.9343 33.3104 16.0567 0.0724 33.4325 3.9875 1.6313 0.0580 36.7163 157.9576 108.3166 22.7628 2.4359 5.7735 9.3569 3.8165 3.9569 8.3022 28.0885 20.2939 19.5590 7.5987 160.3100 14.4775 13.5443 175.3742 16.3272 2.1450 4.1046 0.1779 1.2957 252.3182 86.2202 17.1706 35.4159 3.9032 0.1002 9.1036 3.3107 21.9392 13.4520 15.8408 25.4270 10.0213 12.0130 37.6636
temp: 298.150 k
press: 1.00000 atm
elementType: 8 8 8 7 7 6 6 6 6 6 6 6 6 6 6 6 6 6 6 6 6 1 1 1 1 1 1 1 1 1 1 1 1 1 1
symmnumber: 1
zpe: 703865.0 jmol-1
zpe.correction: 0.268088 hartree
zpe.thermalcorrener: 0.286266 hartree
zpe.thermalcorrenthalpy: 0.287210 hartree
zpe.thermalcorrgfe: 0.218783 hartree
zpe.sumelectzpe: -951.801394 hartree
zpe.sumelectthermal: -951.783216 hartree
zpe.sumelectthermalent: -951.782272 hartree
zpe.sumelectthermalfe: -951.850700 hartree
dipole: -0.9453 1.1565 -1.9195
dipole: 2.4322
quadrupole: -99.0448 -108.8662 -118.7814
quadrupole: 0.4353 -4.8801 -3.8313
quadrupole: 9.8527 0.0312 -9.8839 0.4353 -4.8801 -3.8313
hfenergy: -952.0694822 hartree
pointgroup: C01 [X(C16H14N2O3)]
dipole: -0.4964686 -0.5119115 0.6380523 debye
polarizability: 261.8539908|-13.4972913|166.0595834|-13.0746814|36.5549175|168.0245474 unknown
InChI: InChI=1S/C16H14N2O3/c1-17-16(19)21-14(11-7-3-2-4-8-11)15-18-12-9-5-6-10-13(12)20-15/h2-10,14,17H,1H3
charge 0 multiplicity 1
35 atoms
O  -1.805286 0.183207 -0.960711
O  0.626166 -1.61107 0.090739
O  1.476363 -2.370896 -1.989761
N  -1.082392 0.932651 1.108809
N  1.188035 -3.798025 -0.139704
C  0.585726 -0.208761 -0.482652
C  -0.723552 0.352231 -0.02371
C  1.841825 0.550372 -0.089885
C  -2.918616 0.729208 -0.288534
C  -2.473287 1.191295 0.983004
C  2.914572 0.579797 -1.018001
C  1.995193 1.175932 1.174116
C  -4.241674 0.834639 -0.734639
C  -3.384739 1.792918 1.875306
C  4.124946 1.229285 -0.691111
C  3.207804 1.821968 1.498229
C  -5.146185 1.439348 0.170225
C  -4.726092 1.908268 1.448825
C  4.274456 1.852698 0.569164
C  1.138138 -2.594244 -0.797995
C  1.659205 -5.023553 -0.789785
H  0.548396 -0.326787 -1.580982
H  2.801338 0.076762 -1.985347
H  1.160937 1.167735 1.881514
H  -4.556607 0.472971 -1.716668
H  -3.057109 2.152455 2.854651
H  4.946658 1.247882 -1.415553
H  3.320051 2.306623 2.474691
H  -6.19623 1.549176 -0.120771
H  -5.464087 2.369307 2.113617
H  5.212578 2.358625 0.824667
H  0.883015 -3.810271 0.833856
H  0.865975 -5.793379 -0.81835
H  2.543031 -5.437937 -0.270595
H  1.943351 -4.771329 -1.823561
