program: Gaussian 09
title: 000190666
version: EM64L-G09RevD.01
frameworkgroup: C1[X(C17H16N2O3)]
method: RPBEPBE
basis: SDD
operation: Freq
keyword: #p
keyword: freq=noraman
keyword: PBEPBE/SDD
title: #p freq=noraman PBEPBE/SDD
converged: YES YES NO NO
title: Mulliken charges:
elementType: O O O N N C C C C C C C C C C C C C C C C C H H H H H H H H H H H H H H H H
charge: -0.274183 -0.336752 -0.297436 -0.068941 -0.142304 0.166712 0.279133 0.062995 -0.384294 0.234061 0.045100 -0.341141 -0.356750 -0.241270 -0.236041 -0.360658 -0.342030 -0.211636 -0.218617 0.317680 -0.609535 -0.622549 0.274212 0.254806 0.267119 0.256811 0.232409 0.230160 0.253875 0.256474 0.231510 0.230823 0.222024 0.223850 0.278636 0.224415 0.220366 0.280967
chargesum: 0.00000
title: Mulliken charges with hydrogens summed into heavy atoms:
elementType: O O O N N C C C C C C C C C C C C C C C C C
charge: -0.274183 -0.336752 -0.297436 -0.068941 -0.142304 0.166712 0.279133 0.062995 0.144724 0.234061 0.045100 -0.074022 -0.099939 -0.008861 -0.005882 -0.106783 -0.085556 0.019873 0.012205 0.317680 0.114976 0.103199
polarizability: 3.27664482e+02 4.65089735e+01 2.41579189e+02 -9.12823911e+00 8.26183892e+00 1.08212427e+02
1716.lowfreq: -4.3297 -3.8730 -0.0009 -0.0007 -0.0006 4.6629 11.9266 19.1670 34.8665
frequency: 10.7153 18.9109 34.8384 49.9146 66.7425 89.6588 97.5890 118.8236 136.2882 138.1179 177.2233 205.2398 227.0386 248.0067 254.8460 266.4399 298.3475 321.4107 346.9121 364.2185 412.3302 425.6865 446.1179 510.1941 519.6602 543.6234 565.6268 573.5106 576.1004 607.4349 614.1326 674.8227 680.4875 688.1220 719.2894 750.5986 761.8705 763.7166 780.4642 781.2625 805.2560 842.4311 861.8919 872.0076 886.8427 936.1865 941.4822 965.0157 967.8609 980.6655 995.7375 1003.1586 1004.5595 1030.5707 1047.9013 1058.4172 1095.4298 1098.0223 1115.9237 1133.8160 1148.7291 1149.4230 1174.8423 1178.3139 1196.2479 1208.6729 1247.0150 1251.6951 1258.3481 1276.9606 1283.2755 1336.4036 1371.9365 1389.6378 1398.9127 1415.7314 1419.2383 1433.6935 1435.9947 1440.1342 1459.5714 1472.4857 1475.5038 1478.0312 1487.3001 1500.4165 1538.0021 1576.6021 1606.5676 1617.2629 1622.0549 1657.8152 2961.4810 2968.3174 3023.9582 3030.0638 3038.8744 3090.6007 3123.4209 3133.6312 3139.6015 3145.6272 3152.6970 3156.5752 3171.8102 3173.7786 3178.3989 3181.1943
redmass: 4.7154 4.7508 4.1818 4.9715 5.3567 3.1985 1.4233 3.3964 3.6417 1.1265 5.7395 5.1186 2.9864 2.8845 5.4780 4.0681 7.0004 5.0532 4.1863 3.1744 3.6282 2.9927 3.0301 3.9182 6.1123 7.4699 6.7960 3.7875 4.8555 6.1211 7.0281 6.4491 6.0542 11.8132 2.3355 2.3405 2.4077 2.8993 5.3006 1.6369 5.5160 11.6424 1.4063 7.2168 1.3252 4.9275 1.3810 1.4738 8.4812 1.3066 1.5301 2.0370 1.7547 3.4593 2.2661 1.3663 2.1685 1.2188 1.8785 2.5139 1.3681 1.4992 1.9139 1.0954 3.1145 2.2590 1.8920 1.8946 3.0578 1.5251 1.6212 1.5068 4.5588 2.6195 4.4197 1.5764 1.1642 2.2817 1.1909 1.7875 2.6771 1.0496 2.5984 1.0496 1.0453 1.1944 8.3894 6.6045 6.8565 7.5327 7.2903 7.9112 1.0378 1.0373 1.0595 1.1013 1.1018 1.1023 1.0969 1.0863 1.0863 1.0950 1.0917 1.0913 1.0933 1.0958 1.0981 1.0993
irintensity: 0.5140 0.9796 3.2480 0.6419 1.2317 0.4405 0.3552 1.1047 0.5939 0.1607 2.6418 0.6396 7.6252 2.1541 0.5436 2.2400 0.5090 0.3341 20.4591 24.2795 5.3129 2.5795 10.8756 0.0590 3.6242 2.3737 1.2443 0.0058 1.2560 7.7126 0.6148 1.4728 1.4845 13.2526 17.8042 42.9646 35.6750 80.3596 27.5750 39.8114 33.7865 33.7089 0.0280 2.1253 0.4137 50.2556 4.0883 0.5667 87.3595 0.0019 5.9689 10.0209 12.8102 90.2455 15.9840 10.4562 8.0126 0.1393 72.7510 522.2641 0.0800 14.0956 10.2597 1.3457 31.5746 15.5296 5.3423 20.8573 3.9203 0.2850 5.3135 21.3154 87.2636 88.1764 4.3794 0.9620 31.0098 44.6419 34.3250 14.0470 7.3477 20.3460 38.2037 2.3059 32.1739 32.1252 75.4845 7.4366 0.1521 3.3610 13.2342 353.7321 37.8441 141.6421 28.7887 46.4796 30.9380 2.4179 2.0373 1.9399 3.3426 2.9494 18.1572 14.4375 9.7152 10.3421 19.5808 15.8018
temp: 298.150 k
press: 1.00000 atm
elementType: 8 8 8 7 7 6 6 6 6 6 6 6 6 6 6 6 6 6 6 6 6 6 1 1 1 1 1 1 1 1 1 1 1 1 1 1 1 1
symmnumber: 1
zpe: 775696.7 jmol-1
zpe.correction: 0.295447 hartree
zpe.thermalcorrener: 0.315106 hartree
zpe.thermalcorrenthalpy: 0.316050 hartree
zpe.thermalcorrgfe: 0.243990 hartree
zpe.sumelectzpe: -991.027600 hartree
zpe.sumelectthermal: -991.007941 hartree
zpe.sumelectthermalent: -991.006997 hartree
zpe.sumelectthermalfe: -991.079057 hartree
dipole: 0.9994 0.9116 -1.7524
dipole: 2.2138
quadrupole: -87.3892 -115.7715 -135.7031
quadrupole: 2.2568 -6.3696 4.8961
quadrupole: 25.5654 -2.8169 -22.7485 2.2568 -6.3696 4.8961
hfenergy: -991.323047 hartree
pointgroup: C01 [X(C17H16N2O3)]
dipole: 0.3571707 -0.2226926 0.7624991 debye
polarizability: 333.5283303|-31.0042197|230.9406305|36.654648|-7.5271616|112.9871368 unknown
InChI: InChI=1S/C17H16N2O3/c1-19(2)17(20)21-11-12-7-3-4-8-13(12)16-18-14-9-5-6-10-15(14)22-16/h3-10H,11H2,1-2H3
charge 0 multiplicity 1
38 atoms
O  -2.764506 -1.441693 -0.22779
O  2.420382 1.099724 0.934992
O  2.794046 1.857801 -1.267887
N  -1.760785 0.633542 0.04737
N  4.455407 2.034227 0.383949
C  -0.333599 -1.454689 0.223112
C  0.927068 -0.8185 0.474464
C  -1.55803 -0.683305 0.028355
C  1.0522 0.696882 0.547468
C  -3.761285 -0.454911 -0.371108
C  -3.143169 0.817091 -0.202219
C  -0.407546 -2.876031 0.155252
C  2.066509 -1.636277 0.652639
C  0.740585 -3.667652 0.331977
C  1.98428 -3.043589 0.581852
C  -5.124802 -0.628561 -0.633216
C  -3.914576 1.994133 -0.298788
C  -5.888297 0.560652 -0.726625
C  -5.294441 1.845008 -0.563078
C  3.205762 1.686122 -0.088848
C  5.408248 2.666527 -0.540391
C  4.893777 1.851152 1.775363
H  0.798023 1.165078 -0.420281
H  0.38166 1.121322 1.31139
H  -1.377316 -3.342376 -0.039101
H  3.025516 -1.151968 0.854609
H  0.667814 -4.75877 0.27571
H  2.886763 -3.648815 0.721988
H  -5.57374 -1.617123 -0.759314
H  -3.45345 2.97787 -0.174772
H  -6.961855 0.48938 -0.931059
H  -5.925256 2.73633 -0.645925
H  6.339116 2.070687 -0.604647
H  5.66644 3.68698 -0.196109
H  4.947863 2.728294 -1.537512
H  5.15103 2.828497 2.229191
H  5.792746 1.204916 1.815032
H  4.089717 1.387246 2.360758
