program: Gaussian 09
title: 000190654
version: EM64L-G09RevD.01
frameworkgroup: C1[X(C16H13BrN2O3)]
method: RPBEPBE
basis: SDD
operation: Freq
keyword: #p
keyword: freq=noraman
keyword: PBEPBE/SDD
title: #p freq=noraman PBEPBE/SDD
converged: YES YES NO NO
title: Mulliken charges:
elementType: Br O O O N N C C C C C C C C C C C C C C C C H H H H H H H H H H H H H
charge: 0.009665 -0.241700 -0.330671 -0.273098 -0.039067 -0.377878 -0.340337 0.245098 0.575925 0.252705 0.039080 -0.442226 -0.334589 -0.368274 -0.345931 -0.192194 -0.234089 -0.235222 -0.210309 -0.223265 0.328763 -0.605453 0.318609 0.265901 0.255602 0.258589 0.249663 0.230633 0.235857 0.232171 0.232002 0.328872 0.232021 0.229986 0.273162
chargesum: 0.00000
title: Mulliken charges with hydrogens summed into heavy atoms:
elementType: Br O O O N N C C C C C C C C C C C C C C C C
charge: 0.009665 -0.241700 -0.330671 -0.273098 -0.039067 -0.049005 -0.021728 0.245098 0.575925 0.252705 0.039080 -0.442226 -0.068688 -0.112672 -0.087342 0.057468 -0.003456 0.000634 0.021862 0.008737 0.328763 0.129716
polarizability: 2.45275282e+02 1.19041384e+00 1.81393066e+02 -1.72055313e+01 -6.43468833e-01 2.09572825e+02
1716.lowfreq: -4.4682 -2.5718 -0.0003 0.0006 0.0006 6.3481 11.0036 20.7066 29.1079
frequency: 10.7840 20.6746 29.0981 37.3265 48.3571 55.3384 100.9137 104.8286 122.9283 151.0432 165.5950 177.7340 208.2626 233.7697 255.1242 276.1709 283.8358 313.4022 349.2565 373.5538 433.8254 443.3410 452.5919 496.8874 537.5613 558.7634 576.4387 578.3438 611.1806 615.0808 638.1898 671.0974 687.8955 690.9713 727.4574 753.8260 754.5899 765.5905 768.9760 806.7803 833.9978 856.2308 863.5269 870.7509 877.5413 889.3182 938.7486 945.2201 959.5898 983.2324 992.1100 1001.9571 1006.4735 1041.7194 1079.1247 1092.3267 1117.9576 1126.9394 1129.2636 1146.5874 1162.3232 1173.4309 1182.5048 1200.9910 1207.0226 1249.2779 1264.2037 1272.8493 1282.1974 1319.7720 1377.2168 1401.2527 1422.1379 1432.3158 1433.6917 1458.3378 1460.1534 1460.9503 1484.3920 1515.2254 1539.0965 1574.6342 1602.1781 1610.0167 1620.6478 1695.9766 2982.6819 3044.3831 3061.2195 3116.4777 3136.9423 3139.7210 3153.0796 3157.1010 3168.1595 3175.4861 3176.6652 3182.2295 3575.4112
redmass: 8.7392 6.0630 5.3789 5.9836 4.7802 5.7715 1.1378 7.3164 4.7649 3.2409 6.0320 6.0165 6.6171 6.7541 6.1897 6.6183 5.5687 8.4477 5.7041 5.8986 3.1822 3.5475 6.1160 4.6545 6.3604 5.6295 1.2486 2.9444 7.0455 6.8218 6.7574 6.9023 5.7821 11.4290 5.0337 1.8617 2.3309 1.7985 2.1463 5.0311 5.6858 4.9072 1.4174 3.2746 2.2388 4.1772 7.4361 1.3963 1.3836 1.3086 1.3342 2.0461 7.2719 2.1620 6.0914 2.4147 1.7987 1.2936 2.1618 1.6321 1.3173 1.0710 2.7253 2.2694 2.1738 3.4880 1.5593 1.4192 1.5213 1.4198 5.0176 4.5872 2.1208 2.8737 1.1803 2.4870 1.3533 2.6319 1.0443 1.3870 9.6865 6.1677 6.9520 7.7938 7.9997 9.3304 1.0354 1.0835 1.1028 1.0984 1.0859 1.0865 1.0909 1.0915 1.0943 1.0958 1.0999 1.0991 1.0772
irintensity: 0.0695 0.1308 0.0877 0.9451 7.1408 2.2332 0.2118 0.8162 0.1652 2.1200 2.1478 3.3771 0.3289 2.4384 0.3695 3.3524 9.8490 8.0748 15.5812 9.0029 5.6392 12.5574 0.8889 2.1072 6.2410 2.4184 103.6940 22.5815 1.6402 1.8705 8.1085 17.6929 12.0431 21.2082 0.8101 53.0370 48.8469 66.5834 33.3483 39.8480 49.3735 23.7823 0.0733 3.9806 36.5494 23.2978 209.0770 11.7332 0.5220 0.0127 0.3261 8.4599 47.4664 4.3571 316.4361 12.1051 4.9030 0.4604 16.7331 30.0509 4.7523 3.3991 20.4093 238.3262 2.9688 21.9783 24.3195 9.4333 8.1455 6.2272 2.5561 9.3472 25.6480 20.8653 29.2721 22.9902 175.5596 7.2261 15.5691 170.0739 18.8827 10.0287 3.7830 3.6819 3.2068 256.8715 83.1447 12.7823 33.8846 3.6576 2.0512 3.4343 12.0787 14.1830 8.3376 8.8555 15.1746 11.9404 36.2588
temp: 298.150 k
press: 1.00000 atm
elementType: 35 8 8 8 7 7 6 6 6 6 6 6 6 6 6 6 6 6 6 6 6 6 1 1 1 1 1 1 1 1 1 1 1 1 1
symmnumber: 1
zpe: 676562.1 jmol-1
zpe.correction: 0.257689 hartree
zpe.thermalcorrener: 0.277446 hartree
zpe.thermalcorrenthalpy: 0.278390 hartree
zpe.thermalcorrgfe: 0.204634 hartree
zpe.sumelectzpe: -964.586898 hartree
zpe.sumelectthermal: -964.567141 hartree
zpe.sumelectthermalent: -964.566197 hartree
zpe.sumelectthermalfe: -964.639953 hartree
dipole: 0.9155 2.1478 4.3794
dipole: 4.9629
quadrupole: -119.0398 -115.5470 -131.0851
quadrupole: -4.2619 -7.9175 1.0302
quadrupole: 2.8509 6.3436 -9.1945 -4.2619 -7.9175 1.0302
hfenergy: -964.8445869 hartree
pointgroup: C01 [X(C16H13Br1N2O3)]
dipole: -0.5347931 -0.9516042 1.6189117 debye
polarizability: 237.6449237|-25.9369705|193.7866142|8.7722754|-7.2523614|204.8096346 unknown
InChI: InChI=1S/C16H13BrN2O3/c1-18-16(20)22-14(10-6-2-3-7-11(10)17)15-19-12-8-4-5-9-13(12)21-15/h2-9,14,18H,1H3
charge 0 multiplicity 1
35 atoms
Br 2.077033 2.326624 -1.668914
O  -1.121448 0.533005 1.057489
O  0.39456 -1.807025 -0.321872
O  1.754932 -2.232696 -2.218513
N  -1.666779 0.630218 -1.196038
N  0.802439 -3.957308 -0.927699
C  0.585064 -0.347845 -0.558507
C  -0.74877 0.288033 -0.308876
C  1.705398 0.188258 0.329366
C  -2.41685 1.082211 0.950908
C  -2.751738 1.142828 -0.432587
C  2.458184 1.337673 -0.010875
C  2.014597 -0.463602 1.549694
C  -3.267216 1.51249 1.976673
C  -4.001611 1.657564 -0.835098
C  3.493955 1.822354 0.814458
C  3.044533 0.005955 2.389524
C  3.788099 1.149917 2.021324
C  -4.518431 2.025235 1.559193
C  -4.87801 2.095835 0.18188
C  1.061238 -2.651369 -1.261194
C  1.335424 -5.079025 -1.706396
H  0.831547 -0.199889 -1.62542
H  1.433699 -1.350345 1.81959
H  -2.984007 1.457913 3.03088
H  -4.270782 1.710471 -1.893563
H  4.061134 2.709283 0.517895
H  3.265898 -0.516288 3.326196
H  4.59333 1.52271 2.663247
H  -5.228147 2.377879 2.315134
H  -5.858022 2.501417 -0.090512
H  0.192683 -4.125453 -0.127235
H  0.521811 -5.678153 -2.155227
H  1.963912 -5.737705 -1.079432
H  1.955941 -4.66537 -2.516796
