program: Gaussian 09
title: 000190616
version: EM64L-G09RevD.01
frameworkgroup: C1[X(C8H8FNO2)]
method: RPBEPBE
basis: SDD
operation: Freq
keyword: #p
keyword: freq=noraman
keyword: PBEPBE/SDD
title: #p freq=noraman PBEPBE/SDD
converged: NO YES NO NO
title: Mulliken charges:
elementType: F O O N C C C C C C C C H H H H H H H H
charge: -0.222040 -0.426400 -0.260603 -0.430085 0.301755 0.167744 -0.277464 -0.490542 -0.360898 0.318691 0.215487 -0.795937 0.317878 0.331494 0.252070 0.256576 0.238642 0.268002 0.238673 0.356959
chargesum: 0.00000
title: Mulliken charges with hydrogens summed into heavy atoms:
elementType: F O O N C C C C C C C C
charge: -0.222040 -0.069441 -0.260603 -0.098592 0.301755 0.167744 0.040414 -0.238472 -0.104322 0.318691 0.215487 -0.050620
polarizability: 1.61603350e+02 -5.17236086e-01 1.04302797e+02 -8.93062235e-04 8.46872662e-06 4.60969968e+01
1716.lowfreq: -73.9329 -11.8488 -6.3855 -0.0009 -0.0006 0.0007 7.5848 69.3407 72.9036
frequency: -73.8847 69.3394 72.9035 137.2579 175.6217 223.0573 252.6545 296.7817 320.1685 335.3023 367.4479 441.7860 469.5050 487.9942 527.2310 576.3962 599.5611 629.6325 675.9802 703.1189 712.2523 806.9876 807.7938 841.9934 917.8689 942.2246 975.5145 988.0383 1031.9557 1069.2518 1122.8632 1156.7104 1204.3877 1227.8303 1288.2106 1315.8958 1375.9955 1390.6070 1434.7994 1447.1659 1467.8396 1480.0084 1526.4499 1592.0599 1628.3405 1651.4692 2989.0365 3074.3424 3137.9228 3155.6135 3174.6621 3199.8128 3522.8309 3586.7115
redmass: 1.0545 5.8587 4.1160 5.3496 4.6036 7.0973 12.3907 4.7158 1.1373 4.9127 5.1059 3.0395 4.8593 5.3944 8.4713 3.3741 3.6165 4.9016 1.1991 3.0613 7.7604 4.3814 1.5559 1.4566 5.3038 5.2289 1.2963 1.6251 1.6579 2.4991 1.6024 1.2000 1.7238 2.7840 1.6450 3.7452 1.2362 4.9394 3.2843 1.3090 1.0466 1.9988 2.8511 6.2537 5.4734 7.0391 1.0383 1.0984 1.0981 1.0928 1.0907 1.0958 1.0765 1.0663
irintensity: 0.0538 2.4233 8.3681 5.9103 0.9943 0.7606 0.4188 8.0602 143.2547 11.3736 0.0038 22.3243 0.6766 25.4438 6.8460 5.3650 11.0181 0.6783 64.4042 23.6165 13.9506 8.8989 22.1946 69.2308 15.5450 38.6814 4.5163 34.9286 8.4991 39.6962 197.7853 53.6242 20.7340 64.0353 31.5451 22.3609 34.4484 217.5152 88.9548 30.1942 19.6626 33.3319 472.5847 52.5673 150.5131 8.2235 8.2234 14.7979 7.1029 2.3835 2.6279 7.3084 33.4945 51.1460
temp: 298.150 k
press: 1.00000 atm
elementType: 9 8 8 7 6 6 6 6 6 6 6 6 1 1 1 1 1 1 1 1
symmnumber: 1
zpe: 386436.8 jmol-1
zpe.correction: 0.147186 hartree
zpe.thermalcorrener: 0.157797 hartree
zpe.thermalcorrenthalpy: 0.158741 hartree
zpe.thermalcorrgfe: 0.110686 hartree
zpe.sumelectzpe: -613.828112 hartree
zpe.sumelectthermal: -613.817502 hartree
zpe.sumelectthermalent: -613.816557 hartree
zpe.sumelectthermalfe: -613.864612 hartree
dipole: -0.6682 3.6208 -0.0003
dipole: 3.6820
quadrupole: -55.4570 -73.9703 -71.5815
quadrupole: 2.1461 -0.0002 0.0008
quadrupole: 11.5460 -6.9674 -4.5786 2.1461 -0.0002 0.0008
hfenergy: -613.9752983 hartree
pointgroup: C01 [X(C8H8F1N1O2)]
dipole: 0.3027813 1.4165936 0.0040851 debye
dipolederiv: -0.3115714 0.2208703 0.0005303 0.1864515 -0.9406553 -0.0020846 0.0004359 -0.0020864 -0.1413313 -1.6202253 0.2211947 0.000153 0.2755361 -0.0983897 0.0010135 0.0003349 0.0009872 -0.4283468 -0.6828326 0.0570204 0.0000106 -0.578761 -0.9333767 -0.0017674 -0.0018882 -0.0016918 -0.3454034 -1.7728098 -0.1725405 -0.0011054 -0.3852525 -0.430744 -0.0005105 -0.0016154 -0.0003752 -0.3079066 0.9282221 -0.1852739 -0.0001492 -0.2430004 -0.2550351 -0.0008951 -0.0003459 -0.0008771 0.0402679 0.3236363 0.0043847 0.0001018 -0.2498733 1.0311229 0.0025272 -0.0005497 0.0026365 0.0611532 0.0313943 -0.1330842 -0.000305 0.0757731 0.0664671 0.000562 0.0002544 0.0004868 -0.1347962 -0.3674238 0.006317 -0.0000393 0.3067246 -0.1515155 0.0002598 0.0007753 0.000141 -0.205236 -0.3682848 0.1076756 0.000217 -0.2745079 0.0881737 0.0006172 -0.0008129 0.0007702 -0.1795302 1.5107424 -0.2042812 -0.0000184 -0.1823412 0.1128273 0.0000183 0.0000202 0.000016 0.0780914 1.8000538 0.1306761 0.0010791 0.9239717 1.2027192 0.0031217 0.0035251 0.0029091 0.1716999 -0.3848845 0.1418912 0.0001673 0.2676449 -0.1217868 -0.0003293 0.0002672 -0.0003385 0.0566847 0.1534538 -0.0564554 -0.0001571 -0.0250748 0.0896577 -0.0002527 -0.0000667 -0.0002689 0.1816449 0.1885944 -0.0103489 -0.0000671 0.0351847 0.1652119 -0.0003969 0.0000867 -0.0004107 0.3163631 -0.0036979 -0.0746479 -0.0002804 -0.0649327 0.0309223 -0.0004813 -0.0002563 -0.000485 0.2004776 0.0699161 0.0468412 0.0000871 0.0590878 -0.0217759 -0.0005039 0.0001221 -0.0005115 0.1742123 0.0534749 -0.0001587 -0.0306121 0.0364298 0.0348122 -0.1049503 0.0236618 -0.1101899 -0.0306713 -0.0094026 -0.0504527 -0.0001799 -0.1177937 0.0257511 -0.0003183 -0.0003527 -0.0003024 0.1312419 0.0534027 -0.0004157 0.030694 0.0364382 0.0337417 0.1052768 -0.0233626 0.1104827 -0.0295307 0.408242 -0.0492119 -0.0001265 -0.0817047 0.0718719 -0.000906 -0.0002332 -0.0008919 0.3909154 unknown
polarizability: 161.5872086|-1.0915207|104.3184947|0.0423736|0.1573988|46.0974401 unknown
InChI: InChI=1S/C8H8FNO2/c1-5(11)10-8-3-2-6(12)4-7(8)9/h2-4,10,12H,1H3
charge 0 multiplicity 1
20 atoms
F  0.249498 2.49051 0.006826
O  3.90498 -0.772255 -0.000619
O  -2.676437 -1.585148 -0.005502
N  -1.620746 0.509303 0.000788
C  -0.255614 0.124722 0.000256
C  0.719651 1.149307 0.003373
C  0.223233 -1.214179 -0.003153
C  2.099448 0.923475 0.003289
C  1.606413 -1.479131 -0.003352
C  2.544604 -0.421392 -0.000168
C  -2.744687 -0.320875 -0.001843
C  -4.070202 0.440276 -0.000546
H  -0.504476 -2.026975 -0.005573
H  -1.784422 1.519676 0.003467
H  2.787468 1.775709 0.005852
H  1.974883 -2.508397 -0.005983
H  -4.164216 1.080296 0.896198
H  -4.892024 -0.289506 -0.002794
H  -4.163381 1.08484 -0.89412
H  4.483626 0.029946 0.001807
