program: Gaussian 09
title: 000190653
version: EM64L-G09RevD.01
frameworkgroup: C1[X(C16H13FN2O3)]
method: RPBEPBE
basis: SDD
operation: Freq
keyword: #p
keyword: freq=noraman
keyword: PBEPBE/SDD
title: #p freq=noraman PBEPBE/SDD
converged: YES YES NO NO
title: Mulliken charges:
elementType: F O O O N N C C C C C C C C C C C C C C C C H H H H H H H H H H H H H
charge: -0.196988 -0.240609 -0.321241 -0.279051 -0.026915 -0.377609 -0.294613 0.202023 0.315831 0.238643 0.037369 0.145952 -0.299923 -0.366924 -0.344491 -0.368046 -0.245422 -0.200162 -0.210998 -0.221708 0.333346 -0.605830 0.308915 0.258454 0.257176 0.257137 0.255317 0.229349 0.233868 0.232896 0.231690 0.328782 0.230915 0.230256 0.272611
chargesum: 0.00000
title: Mulliken charges with hydrogens summed into heavy atoms:
elementType: F O O O N N C C C C C C C C C C C C C C C C
charge: -0.196988 -0.240609 -0.321241 -0.279051 -0.026915 -0.048826 0.014301 0.202023 0.315831 0.238643 0.037369 0.145952 -0.041469 -0.109749 -0.087354 -0.112730 -0.016073 0.033706 0.021897 0.009981 0.333346 0.127952
polarizability: 2.45399463e+02 -1.32229857e+01 1.89041060e+02 7.31854840e-01 1.72316833e+01 1.57858719e+02
1716.lowfreq: -0.0006 -0.0004 -0.0003 3.0051 3.6160 7.1691 12.6362 20.1980 27.1199
frequency: 12.6202 19.9243 27.0986 41.1421 48.9514 57.7914 99.7262 123.4961 144.3910 160.2875 181.2506 204.7008 209.5746 244.8246 254.8534 287.2105 309.2032 341.1094 423.0551 441.5026 448.8225 454.1977 509.0608 520.8205 541.6592 566.4636 575.8231 577.0562 610.5203 615.4272 642.8032 684.4007 692.1932 730.4413 755.3764 757.9693 765.8570 767.6997 781.7655 820.0150 848.1739 855.9942 864.5243 870.1579 876.0557 907.3849 932.6820 945.3190 950.8476 983.3073 983.3825 1001.7079 1030.6603 1076.3363 1082.2097 1083.6564 1103.9115 1125.6011 1145.8409 1156.3832 1165.5733 1171.7007 1173.1120 1200.4678 1220.7943 1231.5626 1279.4201 1280.8809 1311.5279 1347.6344 1396.4796 1402.7190 1430.6421 1433.0406 1441.5936 1460.4244 1460.4991 1480.3926 1483.7520 1515.4427 1540.8679 1593.6457 1610.1965 1620.9574 1625.5483 1693.3490 2981.7909 3039.6012 3060.4428 3115.0893 3140.0051 3140.2135 3156.1325 3157.4292 3171.8222 3175.4617 3181.0467 3182.8472 3576.1347
redmass: 6.6063 5.3787 5.3099 5.2349 4.9326 5.4661 1.1301 5.5781 3.6930 5.0192 5.5664 6.3301 7.6832 7.4313 6.1995 5.3726 6.4416 5.3005 3.8151 4.8728 5.9483 3.5829 5.3132 6.6241 6.5234 5.0779 1.1299 3.9047 7.0282 6.8978 6.9093 5.8714 11.0773 4.6197 1.8832 2.8511 1.6237 2.1574 6.4453 5.4079 5.0981 1.8150 1.4254 5.1928 4.6266 6.6488 4.9869 1.3820 1.5420 1.3175 1.3183 2.0669 2.0847 4.1173 3.2084 3.7499 1.9174 1.2811 1.6456 1.2769 1.2581 1.5015 2.5558 2.2472 2.3898 2.7378 1.5911 1.4783 1.3515 2.1772 4.6212 3.7799 1.1610 3.0450 2.3196 2.0148 1.5721 2.7411 1.0445 1.4020 10.0975 6.5742 7.8499 7.9860 7.6409 9.2856 1.0353 1.0834 1.1028 1.0984 1.0861 1.0864 1.0912 1.0915 1.0953 1.0960 1.0995 1.0990 1.0773
irintensity: 0.4798 0.0752 0.3327 3.0166 6.5760 2.7867 0.2152 1.8330 2.5880 1.0267 1.6493 1.5928 1.3506 3.1677 0.2127 8.4112 9.5089 15.8724 7.3522 6.8121 4.6203 8.4250 8.4972 5.7260 2.0821 2.3922 126.3457 0.9850 0.8719 6.7848 7.5985 8.8804 19.9359 1.5838 53.6725 37.8896 70.6021 43.3736 21.0000 16.0946 34.8012 8.5627 0.1071 16.3991 22.2981 54.9386 235.2356 4.9134 18.8261 0.2640 0.2698 11.6518 4.5826 136.5415 42.9458 164.6284 23.5744 0.0112 30.9492 5.9843 7.1355 10.5246 0.5513 244.2078 21.2907 22.7025 15.2454 2.0916 16.9322 2.9852 4.9741 7.2489 25.3803 21.9668 23.3569 45.1340 126.6798 40.5091 16.0043 174.6279 18.6027 10.9061 2.4203 2.2874 12.9438 257.5299 83.2706 23.0931 34.7750 3.7341 2.2127 3.3549 17.2716 13.6098 8.4729 9.8012 8.2993 11.4472 35.6329
temp: 298.150 k
press: 1.00000 atm
elementType: 9 8 8 8 7 7 6 6 6 6 6 6 6 6 6 6 6 6 6 6 6 6 1 1 1 1 1 1 1 1 1 1 1 1 1
symmnumber: 1
zpe: 681425.6 jmol-1
zpe.correction: 0.259541 hartree
zpe.thermalcorrener: 0.278740 hartree
zpe.thermalcorrenthalpy: 0.279684 hartree
zpe.thermalcorrgfe: 0.207872 hartree
zpe.sumelectzpe: -1050.970014 hartree
zpe.sumelectthermal: -1050.950815 hartree
zpe.sumelectthermalent: -1050.949871 hartree
zpe.sumelectthermalfe: -1051.021684 hartree
dipole: -0.7789 1.1995 -3.7010
dipole: 3.9677
quadrupole: -105.1844 -107.3677 -125.8300
quadrupole: -1.8130 -10.2573 -3.9561
quadrupole: 7.6097 5.4263 -13.0360 -1.8130 -10.2573 -3.9561
hfenergy: -1051.2295553 hartree
pointgroup: C01 [X(C16H13F1N2O3)]
dipole: -0.4923637 -0.6360433 1.3378404 debye
polarizability: 245.3481871|-14.5934282|179.8718046|4.1798122|21.1597365|167.0792499 unknown
InChI: InChI=1S/C16H13FN2O3/c1-18-16(20)22-14(10-6-2-3-7-11(10)17)15-19-12-8-4-5-9-13(12)21-15/h2-9,14,18H,1H3
charge 0 multiplicity 1
35 atoms
F  2.215668 1.156721 -2.111894
O  -1.870383 0.008999 -0.911943
O  0.408661 -1.79418 0.146706
O  1.347588 -2.656101 -1.853927
N  -1.008787 1.094113 0.94852
N  0.774983 -4.02847 -0.02762
C  0.52592 -0.418676 -0.430867
C  -0.745853 0.280927 -0.059927
C  1.7688 0.270667 0.100119
C  -2.916803 0.752509 -0.324873
C  -2.386455 1.42045 0.816453
C  2.591365 1.029411 -0.755407
C  2.153213 0.180583 1.459657
C  -4.24925 0.860653 -0.740723
C  -3.217813 2.247093 1.600295
C  3.76218 1.676294 -0.33048
C  3.323858 0.817412 1.922681
C  4.128972 1.563916 1.028974
C  -5.072567 1.692354 0.055137
C  -4.567112 2.371031 1.201875
C  0.896656 -2.836268 -0.696722
C  1.175931 -5.302947 -0.630125
H  0.583566 -0.518192 -1.530723
H  1.524189 -0.397429 2.142797
H  -4.629452 0.338661 -1.622407
H  -2.824023 2.767093 2.477941
H  4.359452 2.246841 -1.047285
H  3.607515 0.737276 2.977019
H  5.038065 2.059245 1.385802
H  -6.125358 1.817893 -0.219157
H  -5.244174 3.004129 1.784925
H  0.379716 -4.0006 0.912463
H  0.313828 -5.987768 -0.73144
H  1.961042 -5.798864 -0.03038
H  1.578563 -5.092374 -1.633361
