program: Gaussian 09
title: 000190614
version: EM64L-G09RevD.01
frameworkgroup: C1[X(C8H8FNO5S)]
method: RPBEPBE
basis: SDD
operation: Freq
keyword: #p
keyword: freq=noraman
keyword: PBEPBE/SDD
title: #p freq=noraman PBEPBE/SDD
converged: YES YES NO NO
title: Mulliken charges:
elementType: S F O O O O O N C C C C C C C C H H H H H H H H
charge: 1.090258 -0.207535 -0.367941 -0.560924 -0.223603 -0.470303 -0.487158 -0.424060 0.317147 0.302348 0.192996 -0.266969 -0.445854 -0.299072 0.236029 -0.788842 0.322562 0.293287 0.273100 0.348527 0.249574 0.276972 0.246342 0.393117
chargesum: 0.00000
title: Mulliken charges with hydrogens summed into heavy atoms:
elementType: S F O O O O O N C C C C C C C C
charge: 1.090258 -0.207535 -0.367941 -0.167807 -0.223603 -0.470303 -0.487158 -0.075533 0.317147 0.302348 0.192996 0.055593 -0.152567 -0.025971 0.236029 -0.015954
polarizability: 4.01558044e+02 -3.44406451e+00 1.29246978e+02 1.21163438e+01 3.66857630e+00 9.40126440e+01
1716.lowfreq: -18.8774 -0.0002 0.0012 0.0023 0.3166 3.4287 10.0736 26.3207 30.0089
frequency: -18.8592 26.2805 29.9107 35.2291 70.9648 81.3144 99.3152 134.8686 140.3064 153.5267 193.2882 253.3419 260.8184 281.1392 287.0534 307.7748 337.6991 362.0612 377.8288 406.4085 442.5736 472.8994 497.1730 523.7482 539.6690 578.0107 621.1578 636.0240 709.4364 720.2681 742.5795 808.0386 830.5741 836.2934 878.0418 918.7628 926.6446 937.1556 983.2985 985.8039 1036.2162 1065.6367 1084.2686 1151.5141 1195.3379 1215.3257 1274.4999 1313.7640 1342.0243 1384.1482 1429.1124 1451.9665 1466.2505 1469.6707 1492.0683 1539.3887 1609.9257 1647.4957 2992.1935 3076.4065 3142.0657 3178.9470 3190.0124 3205.4898 3447.8798 3496.4710
redmass: 1.0709 10.9024 11.5269 6.3959 4.5812 7.4487 10.6577 5.7524 6.1774 6.2285 5.8582 7.5627 9.8691 7.2713 5.2206 4.8614 1.4731 8.3702 6.0662 7.2812 3.4386 5.1088 6.5406 7.8001 12.6716 3.0612 3.7162 4.7993 2.5848 4.4978 1.6117 4.4023 6.1361 1.6062 1.6433 4.7633 13.2693 3.9993 1.3094 1.7032 1.6764 2.8486 1.1734 1.4470 2.0666 2.6194 1.9797 3.7917 4.1273 1.2301 1.8941 1.5354 1.0457 2.9383 4.1833 2.9632 7.5456 5.3564 1.0388 1.0980 1.0982 1.0911 1.0939 1.0962 1.0653 1.0765
irintensity: 0.9362 1.8381 0.9186 2.7595 7.2996 6.8697 10.6980 6.2849 31.8188 5.3069 8.6679 12.1876 27.0596 13.5646 26.5335 0.4668 61.0409 50.9856 23.5354 39.5866 4.2423 2.8753 46.0879 1.1418 239.0550 0.6452 20.0061 12.7265 10.7164 11.3026 67.4014 2.7301 63.3830 34.7812 73.0589 13.9717 58.5530 10.2926 5.2800 110.8481 9.7659 43.7412 207.8557 17.7891 226.1760 214.8670 21.0849 216.4451 296.0881 75.7514 184.3090 10.0217 22.2114 50.2586 405.1796 295.1297 292.3411 101.6900 2.6719 8.7360 6.1242 0.9791 3.0252 5.9510 97.6812 83.5706
temp: 298.150 k
press: 1.00000 atm
elementType: 16 9 8 8 8 8 8 7 6 6 6 6 6 6 6 6 1 1 1 1 1 1 1 1
symmnumber: 1
zpe: 408676.4 jmol-1
zpe.correction: 0.155657 hartree
zpe.thermalcorrener: 0.172193 hartree
zpe.thermalcorrenthalpy: 0.173138 hartree
zpe.thermalcorrgfe: 0.109093 hartree
zpe.sumelectzpe: -1237.061734 hartree
zpe.sumelectthermal: -1237.045198 hartree
zpe.sumelectthermalent: -1237.044253 hartree
zpe.sumelectthermalfe: -1237.108298 hartree
dipole: -9.2213 2.5712 -1.8310
dipole: 9.7466
quadrupole: -103.7202 -106.6841 -100.0368
quadrupole: -7.1962 -13.2408 1.9564
quadrupole: -0.2399 -3.2037 3.4436 -7.1962 -13.2408 1.9564
hfenergy: -1237.2173911 hartree
pointgroup: C01 [X(C8H8F1N1O5S1)]
dipole: -3.5526734 1.126394 -0.9021965 debye
dipolederiv: 1.7745035 -0.0223743 -0.0191581 -0.8907696 1.1742347 -0.1581454 -0.2060264 0.065853 1.404539 -0.4804202 0.3426569 0.0478366 0.5463304 -0.8063477 -0.0519055 0.1340211 -0.1201104 -0.1482368 0.9840043 -0.1545258 0.3859767 -0.0927257 -0.3489297 -0.0133106 0.4173588 0.0155355 -0.3266301 -0.982645 0.0417986 0.1780892 0.41483 -0.573228 -0.0627169 0.9185254 -0.2010908 -0.6602603 -0.64092 0.0994165 0.0515119 -0.8222904 -0.8592682 -0.0752167 -0.032836 -0.0862692 -0.3290221 -1.0414944 -0.0478228 -0.1816949 0.0377815 -0.4261532 0.0016831 -0.6050698 -0.0166573 -0.5633278 -0.4437383 -0.0245469 0.0282509 0.5620419 -0.5811384 0.2156889 -0.3315755 0.0883836 -0.513222 -3.0366252 -0.2471017 -0.01486 -0.7901113 -0.5077867 0.0124108 0.3651612 0.0183688 -0.2783577 2.0790357 -0.0301584 -0.010769 -0.0441095 0.035311 0.0200852 -0.3369461 -0.0026596 0.1157975 -0.8242852 0.0865313 -0.2835556 -0.1640647 0.2365449 -0.0024503 0.3547485 0.0268023 0.1360037 -0.3088232 -0.3408317 -0.1501185 -1.2608586 0.8980126 -0.0013083 -0.0917455 0.125772 0.0819249 -0.7046988 0.1279032 -0.0464754 0.5803649 -0.1019438 0.0350582 0.1742993 -0.029852 -0.1061855 0.4099821 0.0808782 0.0805022 -0.2088025 -0.0529903 -0.1068788 -0.2034534 0.0120668 -0.1246721 0.6272293 -0.14853 0.0454366 0.3452038 -0.0727667 0.1508831 -0.0828184 -0.0271106 -0.0791822 2.3747259 0.1490972 -0.12497 1.7278968 1.2197056 0.1152541 -0.1934658 0.0999408 0.2266617 -0.5625169 0.0857913 0.0735631 0.2316973 -0.076155 -0.0452318 0.1480837 -0.0329351 0.0190545 0.120296 -0.029553 -0.0074554 0.0133105 0.0876874 -0.0045783 0.014291 -0.0013585 0.1764234 0.0884235 -0.0358499 0.0113398 -0.0063838 0.0618921 -0.0135685 0.000191 -0.0077473 0.1716411 0.0468324 0.0495405 0.0245166 0.0133559 0.0410147 -0.0183077 -0.0156921 0.0098378 0.1277819 0.2410489 -0.0095438 0.0198621 -0.1172851 0.2034902 -0.0270673 -0.0006027 -0.0099473 0.3025609 0.0611849 -0.0105413 -0.0361137 -0.0038669 0.0830553 -0.0888265 0.0047387 -0.0822816 -0.0347524 0.0214189 -0.0412599 0.007484 -0.116691 0.0073917 -0.0025746 -0.0009915 -0.0102875 0.1356856 0.0644215 0.0146702 0.0092951 0.0340238 0.0275799 0.1028914 -0.0307365 0.1029157 0.0182276 0.1330602 0.0643556 -0.0884943 0.0111226 0.3307878 0.0181327 -0.399459 0.0628309 0.2475475 unknown
polarizability: 399.4950545|-14.2863011|130.240028|23.739125|0.8726461|95.0825839 unknown
InChI: InChI=1S/C8H7FNO2.HO3S/c1-5(11)10-8-3-2-6(12)4-7(8)9;1-4(2)3/h2-4,10H,1H3;1H
charge 0 multiplicity 1
24 atoms
S  3.911238 -0.411286 0.681763
F  -1.575531 2.665501 0.105441
O  2.544645 0.351493 -0.902646
O  5.011022 -0.894696 -0.714093
O  -3.622958 -1.88369 -0.051865
O  4.825458 0.476933 1.675577
O  3.152963 -1.717013 1.280338
N  -2.961862 0.363598 0.100068
C  -1.588081 0.261779 -0.141107
C  1.232176 0.319475 -0.624985
C  -0.835679 1.482038 -0.138329
C  -0.878329 -0.954463 -0.382754
C  0.527275 1.547091 -0.35184
C  0.501535 -0.922773 -0.613306
C  -3.922509 -0.676852 0.142957
C  -5.331884 -0.188398 0.44634
H  -1.433352 -1.893165 -0.379265
H  1.068164 2.496826 -0.334518
H  1.057139 -1.849439 -0.782915
H  -3.305003 1.315849 0.26692
H  -5.380916 0.296498 1.438909
H  -6.013137 -1.050597 0.440703
H  -5.675653 0.542994 -0.308268
H  4.426979 -0.778303 -1.522226
