program: Gaussian 09
title: 000190609
version: EM64L-G09RevD.01
frameworkgroup: C1[X(C9H16N3O3PS)]
method: RPBEPBE
basis: SDD
operation: Freq
keyword: #p
keyword: freq=noraman
keyword: PBEPBE/SDD
title: #p freq=noraman PBEPBE/SDD
converged: YES YES NO NO
title: Mulliken charges:
elementType: S P O O O N N N C C C C C C C C C H H H H H H H H H H H H H H H H
charge: -0.200256 0.912860 -0.464706 -0.627517 -0.690259 -0.109447 -0.103735 -0.130057 -0.355646 -0.353291 0.034857 -0.663424 -0.670446 0.252316 0.307061 -0.447586 -0.773709 0.252237 0.210589 0.263389 0.205557 0.211653 0.246104 0.213441 0.200185 0.273207 0.215463 0.259775 0.232923 0.251268 0.232867 0.411735 0.402592
chargesum: 0.00000
title: Mulliken charges with hydrogens summed into heavy atoms:
elementType: S P O O O N N N C C C C C C C C C
charge: -0.200256 0.912860 -0.464706 -0.215782 -0.287667 -0.109447 -0.103735 -0.130057 0.107180 0.115655 0.034857 0.007775 0.018409 0.252316 0.307061 -0.187811 -0.056651
polarizability: 2.12056171e+02 -8.31941260e-01 2.00655008e+02 1.24939580e+00 -8.99884788e+00 1.28402744e+02
1716.lowfreq: -39.9077 -9.2251 -3.4018 -1.8233 -0.0014 0.0014 0.0019 30.0886 38.4545
frequency: -39.8831 30.0553 38.3972 44.9555 54.8372 63.9615 79.1424 98.4807 111.2768 144.0797 172.6917 194.1835 199.9410 217.1462 224.0722 228.7650 250.3780 252.8399 272.7776 285.8150 304.3278 318.3170 330.2115 372.8783 388.4799 439.9141 517.2146 529.6175 538.7062 574.0578 583.3425 636.5699 665.9055 675.4271 705.4823 732.9755 766.8675 772.3720 785.8966 824.5945 833.2051 914.0228 926.8761 969.4371 975.5754 1006.8170 1025.6877 1045.5795 1071.4460 1077.2119 1078.5924 1083.5367 1099.4541 1135.3495 1199.6151 1208.1589 1273.5981 1307.4545 1308.9635 1334.3093 1350.6369 1364.9184 1378.2263 1383.8048 1386.8016 1390.1730 1454.8101 1455.4455 1463.4219 1466.7366 1468.3298 1471.6705 1482.9018 1486.3435 1510.2686 1547.2602 1580.0398 2983.7816 2984.4963 2988.5139 3002.0829 3007.5756 3064.8938 3068.8832 3071.1155 3081.3152 3086.1563 3101.4380 3104.3052 3121.8331 3202.5957 3514.4595 3619.3007
redmass: 1.0241 5.3580 5.8056 6.1046 2.8551 4.3193 2.7014 3.8575 2.0963 5.4719 2.4392 2.5602 3.6928 1.0906 4.0187 3.0395 3.7664 1.9425 2.5634 1.7612 2.6037 5.0822 2.8395 2.4189 4.1647 5.2227 3.9473 7.0832 3.8076 4.6436 4.2124 6.8475 4.7118 11.0154 11.8084 10.8103 3.0706 1.5977 1.2748 1.4904 2.2546 5.1643 2.6759 3.7321 2.0228 2.1460 1.1695 1.5877 2.1518 1.9494 1.4178 1.8040 1.7460 1.8502 2.3266 2.6529 3.6459 1.5246 1.4011 4.5232 1.2325 1.3346 2.2410 1.2200 1.2483 1.6597 1.0866 1.1964 1.0657 1.0463 1.0477 1.1051 1.0538 1.0612 4.6589 4.8899 6.4174 1.0358 1.0356 1.0379 1.0628 1.0631 1.1014 1.0972 1.0994 1.0998 1.0979 1.1023 1.1017 1.0987 1.0944 1.0648 1.0667
irintensity: 0.5493 0.5028 2.7439 2.1915 0.2575 2.1561 2.1230 4.2881 71.5040 4.2203 9.7514 11.4759 4.5655 1.4917 24.2799 7.1625 3.3491 6.1351 64.2680 7.0731 20.8918 17.8704 49.7640 9.3416 53.1508 2.5473 9.8299 36.1014 0.4308 19.4718 4.8715 2.3248 23.1007 327.4479 158.0002 164.9527 9.7079 17.2563 3.2711 42.6295 17.8377 13.7068 34.6086 40.1316 2.7087 7.5538 128.0645 8.5173 1.7514 21.2271 22.4877 75.1528 14.2691 68.3357 0.5445 21.9244 17.7860 9.1649 61.5394 104.5950 3.9742 27.7209 59.6161 4.9876 18.1819 45.5223 30.1137 20.6737 35.3032 15.8766 13.9567 5.9839 4.9017 24.1425 295.0832 157.4811 740.6962 30.6051 30.2846 16.8148 28.6236 58.6158 5.7000 15.1521 8.6115 35.2713 36.9829 18.6825 32.4959 10.9499 0.1056 81.3344 84.9184
temp: 298.150 k
press: 1.00000 atm
elementType: 16 15 8 8 8 7 7 7 6 6 6 6 6 6 6 6 6 1 1 1 1 1 1 1 1 1 1 1 1 1 1 1 1
symmnumber: 1
zpe: 663606.7 jmol-1
zpe.correction: 0.252754 hartree
zpe.thermalcorrener: 0.272556 hartree
zpe.thermalcorrenthalpy: 0.273500 hartree
zpe.thermalcorrgfe: 0.203209 hartree
zpe.sumelectzpe: -1480.468198 hartree
zpe.sumelectthermal: -1480.448396 hartree
zpe.sumelectthermalent: -1480.447452 hartree
zpe.sumelectthermalfe: -1480.517743 hartree
dipole: -1.0096 1.3481 -0.7991
dipole: 1.8642
quadrupole: -104.6648 -106.6604 -117.7184
quadrupole: 7.3484 -1.7746 2.8253
quadrupole: 5.0164 3.0208 -8.0372 7.3484 -1.7746 2.8253
hfenergy: -1480.720952 hartree
pointgroup: C01 [X(C9H16N3O3P1S1)]
dipole: 0.3339784 0.5564219 0.3417338 debye
polarizability: 211.6305779|2.5333286|199.671489|-1.5790338|13.3946999|129.8118556 unknown
InChI: InChI=1S/C9H16N3O3PS/c1-4-12(5-2)9-10-7(3)6-8(11-9)15-16(13,14)17/h6,13-14H,4-5H2,1-3H3
charge 0 multiplicity 1
33 atoms
S  -2.78665 -1.517503 -1.716273
P  -2.946626 -0.462054 0.031435
O  -2.240179 1.175453 0.160301
O  -2.665849 -1.244043 1.536484
O  -4.545748 0.046917 0.46726
N  1.829735 -1.121332 0.0465
N  1.912174 1.243029 0.14722
N  -0.21125 0.046618 0.116021
C  3.308505 -1.171329 0.087492
C  1.074246 -2.393498 -0.071791
C  1.16907 0.076832 0.104336
C  3.945265 -1.101736 -1.316931
C  0.644105 -2.96567 1.295678
C  1.230472 2.423155 0.183256
C  -0.841701 1.233876 0.139868
C  -0.191889 2.480931 0.168321
C  2.054768 3.69106 0.232505
H  3.664864 -0.324415 0.696137
H  3.593789 -2.11099 0.596909
H  0.180825 -2.216506 -0.694944
H  1.726964 -3.109168 -0.605831
H  3.579953 -1.917518 -1.967112
H  3.70239 -0.137066 -1.794095
H  5.045244 -1.187301 -1.243466
H  1.512634 -3.098364 1.967024
H  -0.086587 -2.294005 1.776276
H  0.161012 -3.950287 1.156793
H  -0.742947 3.421064 0.187448
H  1.8260 4.275776 1.142504
H  3.126082 3.439713 0.229019
H  1.83526 4.337957 -0.636749
H  -3.430937 -1.085121 2.156178
H  -5.084195 0.459726 -0.252474
