program: Gaussian 09
title: 000182461
version: EM64L-G09RevD.01
frameworkgroup: C1[X(C25H30O5)]
method: RPBEPBE
basis: SDD
operation: Freq
keyword: #pfreq=noraman
keyword: PBEPBE/SDD
title: #p freq=noraman PBEPBE/SDD
converged: YES YES NO NO
title: Mulliken charges:
elementType: O O O O O C C C C C C C C C C C C C C C C C C C C C C C C C H H H H H H H H H H H H H H H H H H H H H H H H H H H H H H
charge: -0.183280 -0.209101 -0.421962 -0.449015 -0.300512 0.197850 -0.297890 -0.612123 -0.473068 -0.029135 0.512950 -0.769203 0.008541 0.064587 -0.431214 0.178815 -0.592318 0.302734 0.206973 -0.188647 -0.052783 -0.446575 -0.136890 -0.723026 -0.726471 -0.198966 -0.289705 0.366970 -0.784651 -0.792196 0.286356 0.239758 0.229949 0.234827 0.230422 0.232159 0.239088 0.230630 0.223503 0.215081 0.208384 0.257722 0.213721 0.217667 0.236381 0.214821 0.244579 0.259904 0.216370 0.209655 0.285522 0.210424 0.401472 0.406903 0.215618 0.214418 0.227633 0.229098 0.220832 0.216414
chargesum: 0.00000
title: Mulliken charges with hydrogens summed into heavy atoms:
elementType: O O O O O C C C C C C C C C C C C C C C C C C C C C C C C C
charge: -0.183280 -0.209101 -0.020490 -0.042112 -0.300512 0.197850 -0.011535 -0.142415 -0.007819 -0.029135 0.512950 -0.067327 0.008541 0.064587 -0.207710 0.178815 -0.168853 0.302734 0.206973 0.069075 -0.052783 -0.015187 -0.136890 -0.027245 -0.040541 0.086556 -0.079282 0.366970 -0.126982 -0.125852
polarizability: 3.92638986e+02 -2.28773380e+01 3.17103327e+02 -2.67994797e+01 9.02561082e+00 2.02080673e+02
1716.lowfreq: -8.5543 -3.1394 -0.0009 -0.0002 0.0003 5.5414 14.1604 17.0395 23.9969
frequency: 14.1466 17.0108 23.8320 32.7127 43.2089 53.9227 60.2691 72.4676 85.9784 101.5184 108.9510 127.0790 137.8602 142.8386 158.8787 183.5806 186.3583 193.0252 199.3826 203.4258 213.5398 226.7516 229.8503 246.0075 256.1146 265.5266 268.1024 286.3596 293.5238 303.5964 322.1883 328.1010 342.0863 351.5917 376.9934 381.9852 387.6773 399.1198 418.6631 420.0011 442.8081 454.4340 456.0572 463.4732 490.9307 515.6740 529.8989 542.9794 570.2352 589.7785 599.7499 609.7171 636.0972 638.3127 676.5316 724.6976 740.8100 741.6517 750.4570 795.4461 799.2349 811.9362 822.6779 829.6833 842.7186 851.5970 868.0485 905.3999 926.1817 928.2533 938.8409 944.8712 947.2871 961.9569 963.8114 977.1236 986.2200 993.9397 1000.4928 1010.8723 1034.6909 1048.6599 1053.5562 1063.4088 1071.3664 1081.5392 1099.8830 1109.4496 1118.1537 1132.0322 1136.3893 1139.1939 1155.6804 1170.0599 1183.4444 1190.6028 1213.1350 1222.8791 1245.3074 1255.3964 1259.6507 1269.8794 1271.5605 1278.6335 1286.5888 1296.5505 1304.8547 1306.2223 1321.3576 1324.0233 1332.9157 1339.7053 1356.8152 1358.6542 1364.8512 1372.7041 1372.8941 1387.4068 1388.2220 1392.2568 1398.2250 1414.8504 1434.7209 1442.6107 1454.8718 1458.0555 1465.1747 1466.9550 1468.8378 1471.6965 1472.1338 1474.0585 1476.6907 1478.7666 1479.6308 1481.2563 1495.2750 1536.3525 1554.8555 1577.0026 1582.3662 1598.0865 1694.4297 1699.6198 2428.3789 2946.7225 2955.3965 2960.7354 2962.5813 2968.2022 2980.4478 2981.0462 2982.1535 2988.4519 3012.7238 3021.4762 3026.4472 3027.1256 3030.2995 3031.0755 3053.2632 3067.7464 3069.9086 3075.1706 3075.9363 3078.1448 3084.2123 3085.4529 3093.5905 3100.0734 3103.6003 3112.3219 3116.1016 3422.6002
redmass: 4.5700 4.3388 2.9945 4.3241 3.8223 4.9342 3.4698 3.5103 3.0746 4.3146 4.1108 1.0601 6.0671 4.4021 3.6110 1.2885 1.5751 2.6736 2.5400 2.7869 1.1484 2.2963 1.3278 2.3415 2.4003 3.0504 2.6789 3.1529 5.3738 3.5994 4.5741 3.1091 3.8681 5.1293 4.6034 3.1264 4.4293 4.5856 3.4083 3.1487 5.8938 2.8246 4.0681 2.7746 5.6565 4.6350 4.8951 2.9595 4.1184 2.0734 1.8398 4.4914 5.7783 5.3809 3.9201 5.6708 5.8610 3.3365 1.9841 2.5340 2.5800 3.4753 3.7852 2.0155 1.6078 2.5358 2.8424 2.6722 2.5028 1.2024 2.1523 1.7935 1.4068 1.5221 2.1711 1.8173 1.7800 1.2874 4.0121 2.1686 2.0904 2.6025 1.0938 2.7910 3.6774 1.6665 1.8654 2.8682 2.0698 2.1200 2.2636 2.4146 1.9963 1.9541 1.4560 2.1329 2.3116 1.9870 1.9945 1.6956 1.4083 1.3256 1.7768 1.7614 2.5844 1.4100 1.9961 1.3946 1.4038 1.4467 1.5064 1.8351 2.2295 1.4993 2.0215 1.3215 3.2986 1.2948 1.2755 1.2058 1.2374 3.1135 1.1228 4.1468 1.0532 1.0754 1.0472 1.0844 1.0692 1.0515 1.0564 1.0852 1.0520 1.0648 1.0844 1.0554 1.0667 5.3411 5.0570 4.5810 10.6744 4.7709 6.4694 7.0901 1.0755 1.0664 1.0372 1.0640 1.0388 1.0611 1.0383 1.0621 1.0369 1.0351 1.0894 1.0937 1.0970 1.0978 1.0964 1.0885 1.0911 1.0994 1.0959 1.0883 1.0997 1.0966 1.0968 1.0994 1.0955 1.0910 1.1004 1.0934 1.0960 1.0639
irintensity: 0.0335 0.0013 0.0959 0.3169 0.7981 1.6295 0.1243 1.0101 1.0040 0.6986 2.1864 0.1142 1.2960 0.6502 0.0538 0.5940 1.0605 0.5941 1.2323 1.3757 0.2930 0.9441 0.2329 1.1682 0.5665 0.1025 3.7845 1.1704 16.4717 3.1124 1.4990 5.4600 0.0356 5.9313 2.2802 1.1232 1.0810 2.7243 2.2918 6.5900 0.8324 10.3895 0.9051 1.4835 0.4495 4.1011 37.4164 7.1003 0.6547 70.8568 57.0270 9.9637 12.4921 8.4649 9.8588 32.8624 17.8314 0.5707 10.9310 0.9210 11.5466 0.5766 31.6656 14.4940 9.9176 6.1483 0.9827 2.3750 1.4399 4.0411 5.2501 2.2945 1.9342 7.0931 15.3525 2.3163 7.7808 5.1643 3.9660 10.4525 9.8674 44.0730 135.2289 6.5366 98.1256 2.7983 25.3458 0.9982 1.8761 79.6065 37.7813 9.6485 14.9131 45.0343 50.6477 20.2295 7.1001 1.8707 149.3300 178.1564 14.5102 2.9410 66.6301 16.8535 33.4865 53.5981 187.2701 2.1434 4.4650 40.6034 23.9478 7.6130 299.0612 12.2402 13.2498 21.2230 6.9392 21.5450 82.3899 14.5528 10.5904 116.8489 24.7977 54.5159 1.9993 0.1707 1.7871 5.4742 7.9207 19.8890 5.4015 10.9572 6.0661 18.2399 10.4478 4.4626 9.5194 61.4059 53.9693 63.5772 121.3409 223.9387 4.4157 3.7003 382.8321 30.4815 45.7855 15.7906 55.5034 23.8994 15.2500 55.9350 45.7242 35.6714 10.7060 3.7641 6.8789 10.4117 49.2374 27.7636 6.5048 32.5467 29.3789 3.1274 12.5503 63.4647 35.7152 34.4391 45.9408 33.8694 3.8888 5.1417 20.0089 123.5798
temp: 298.150 k
press: 1.00000 atm
elementType: 8 8 8 8 8 6 6 6 6 6 6 6 6 6 6 6 6 6 6 6 6 6 6 6 6 6 6 6 6 6 1 1 1 1 1 1 1 1 1 1 1 1 1 1 1 1 1 1 1 1 1 1 1 1 1 1 1 1 1 1
symmnumber: 1
zpe: 1285827.7 jmol-1
zpe.correction: 0.489746 hartree
zpe.thermalcorrener: 0.520509 hartree
zpe.thermalcorrenthalpy: 0.521453 hartree
zpe.thermalcorrgfe: 0.426544 hartree
zpe.sumelectzpe: -1344.537950 hartree
zpe.sumelectthermal: -1344.507187 hartree
zpe.sumelectthermalent: -1344.506243 hartree
zpe.sumelectthermalfe: -1344.601152 hartree
dipole: -2.1039 0.9356 1.0022
dipole: 2.5112
quadrupole: -186.0380 -186.1230 -174.9268
quadrupole: 10.8968 -3.0498 4.8711
quadrupole: -3.6754 -3.7604 7.4358 10.8968 -3.0498 4.8711
hfenergy: -1345.027696 hartree
pointgroup: C01 [X(C25H30O5)]
dipole: -0.834485 -0.3528594 -0.393977 debye
polarizability: 393.5090446|21.7933932|316.309007|25.5049819|11.0662228|202.0049344 unknown
InChI: InChI=1S/C25H30O5/c1-13(2)7-6-8-15-9-10-17-22(28)19-16(12-26)21(27)23(29)18(14(3)4)20(19)24(30)25(17,5)11-15/h7,9,12,14,17,27,29H,6,8,10-11H2,1-5H3
charge 0 multiplicity 1
60 atoms
O  -0.840653 -1.030527 0.058704
O  2.408457 3.177388 -0.668077
O  4.049972 -3.00277 0.359464
O  5.525003 -0.857983 0.694321
O  5.835647 1.58609 0.748145
C  -0.502645 1.078234 -1.141259
C  0.171874 2.286041 -0.414159
C  -2.042958 1.209802 -1.086533
C  -0.321878 2.431203 1.059359
C  -0.021655 -0.190393 -0.413722
C  -2.614803 1.729482 0.224915
C  -0.046811 1.015093 -2.629005
C  1.685933 2.160146 -0.426601
C  1.470151 -0.366909 -0.240197
C  -1.826045 2.297367 1.174754
C  2.280692 0.810804 -0.141191
C  -4.11355 1.560148 0.412048
C  2.035462 -1.69551 -0.128891
C  3.677813 0.691933 0.191035
C  1.24709 -2.982739 -0.395076
C  3.408764 -1.781712 0.18998
C  -4.506468 0.105546 0.836157
C  4.212321 -0.617633 0.363773
C  1.061814 -3.802354 0.912844
C  1.890229 -3.835806 -1.52489
C  4.596044 1.805696 0.453251
C  -6.004698 -0.057165 0.9817
C  -6.831296 -0.91884 0.31993
C  -8.326656 -0.933188 0.60132
C  -6.378528 -1.927096 -0.722388
H  -0.087299 3.212671 -0.95951
H  -2.483415 0.217792 -1.305502
H  -2.369779 1.881864 -1.907635
H  0.010096 3.41586 1.441368
H  0.16921 1.671606 1.705669
H  -0.280215 1.973112 -3.128744
H  1.036384 0.83178 -2.735829
H  -0.584428 0.210392 -3.162919
H  -2.280268 2.662852 2.1066
H  -4.484784 2.264456 1.181557
H  -4.647642 1.800889 -0.529804
H  0.23867 -2.701312 -0.730136
H  -4.088343 -0.616867 0.113698
H  -4.008159 -0.106842 1.803882
H  0.518407 -3.207879 1.667783
H  0.465746 -4.70821 0.697863
H  2.032997 -4.117735 1.329665
H  2.87905 -4.224403 -1.235198
H  1.229214 -4.694881 -1.743182
H  2.001403 -3.249808 -2.456422
H  4.227381 2.839298 0.404965
H  -6.469374 0.621592 1.716227
H  5.004826 -2.814245 0.58929
H  5.983683 0.097564 0.778648
H  -8.655114 -1.930373 0.957236
H  -8.907358 -0.719698 -0.318645
H  -8.607938 -0.187476 1.365178
H  -5.29628 -1.886321 -0.9255
H  -6.622055 -2.958267 -0.396841
H  -6.913731 -1.764559 -1.679377
