program: Gaussian 09
title: 000182457
version: EM64L-G09RevD.01
frameworkgroup: C1[X(C11H10N2)]
method: RPBEPBE
basis: SDD
operation: Freq
keyword: #pfreq=noraman
keyword: PBEPBE/SDD
title: #p freq=noraman PBEPBE/SDD
converged: YES YES NO NO
title: Mulliken charges:
elementType: N N C C C C C C C C C C C H H H H H H H H H H
charge: -0.063933 -0.047275 -0.012192 0.344215 0.039196 -0.329429 -0.767603 -0.274753 -0.167681 -0.377510 -0.206099 -0.171575 -0.373060 0.238881 0.199066 0.244780 0.253082 0.293889 0.229843 0.240578 0.237942 0.230462 0.239177
chargesum: 0.00000
title: Mulliken charges with hydrogens summed into heavy atoms:
elementType: N N C C C C C C C C C C C
charge: -0.063933 -0.047275 -0.012192 0.344215 0.039196 -0.090549 -0.070675 0.019135 0.062163 -0.136932 0.031843 0.058887 -0.133883
polarizability: 2.06339530e+02 4.16595414e+00 1.37780519e+02 2.36975335e-01 -1.23865370e+00 5.55776893e+01
1716.lowfreq: -8.4777 -5.3681 0.0005 0.0008 0.0008 3.4884 14.7520 83.7524 156.8893
frequency: 14.6641 83.7469 156.8870 173.5772 190.3913 263.4974 308.9876 340.3993 402.8563 430.1625 467.8235 478.1977 553.5695 569.5868 618.4593 623.1620 712.6632 748.6613 758.4584 793.1665 821.2325 822.7869 915.7792 930.8027 962.9843 968.0785 979.5201 995.6217 1018.8088 1023.8270 1044.1770 1046.5033 1053.4897 1082.1679 1129.9364 1158.1160 1184.3726 1252.4103 1261.7101 1299.0073 1312.4021 1333.9942 1400.5707 1404.2180 1411.6177 1435.9740 1447.3629 1455.0749 1463.4127 1541.6066 1558.5953 1576.9162 1583.3785 2988.9905 3086.6869 3089.2020 3122.4979 3123.8437 3132.0185 3140.1869 3164.9660 3165.4384 3184.8564
redmass: 4.0045 4.5591 4.0327 4.0303 1.0477 3.5710 4.8214 4.2206 3.3536 3.8121 3.7412 3.3218 5.8283 2.8708 7.2958 7.6725 6.2069 2.8691 1.8882 1.3490 2.3576 5.6458 1.3182 1.3433 6.5473 1.4454 1.3797 1.5958 1.3401 5.4224 1.9918 1.6257 2.6342 1.6817 1.5819 1.0788 1.7850 2.1526 2.2519 2.0831 7.1070 4.3142 1.5645 1.5608 1.5699 2.5712 1.0595 2.5059 1.1788 5.3646 5.8874 5.8259 5.9836 1.0380 1.0989 1.0961 1.0885 1.0877 1.0915 1.0900 1.0995 1.0984 1.0961
irintensity: 2.1597 4.7366 2.6442 4.5567 1.0337 3.4173 0.5706 0.4261 3.3072 0.1036 0.1429 0.3059 0.2213 0.9846 5.7625 10.2623 2.1698 3.0503 67.5170 66.6333 0.6623 0.8467 0.5001 0.6134 2.9597 1.3509 0.0032 4.7591 0.9830 13.3958 2.5954 9.8397 6.1858 13.8507 3.9263 0.6857 1.0197 0.7179 0.6789 1.0870 0.1063 4.4201 16.1201 33.9510 27.0612 12.1870 15.2996 33.6770 30.4079 16.0239 6.8285 18.9937 31.3362 35.4741 29.5837 10.6801 20.8281 8.7194 25.3663 16.5079 60.1317 4.2583 9.7454
temp: 298.150 k
press: 1.00000 atm
elementType: 7 7 6 6 6 6 6 6 6 6 6 6 6 1 1 1 1 1 1 1 1 1 1
symmnumber: 1
zpe: 477095.0 jmol-1
zpe.correction: 0.181716 hartree
zpe.thermalcorrener: 0.192170 hartree
zpe.thermalcorrenthalpy: 0.193114 hartree
zpe.thermalcorrgfe: 0.144238 hartree
zpe.sumelectzpe: -533.763248 hartree
zpe.sumelectthermal: -533.752794 hartree
zpe.sumelectthermalent: -533.751850 hartree
zpe.sumelectthermalfe: -533.800727 hartree
dipole: -0.0569 0.2126 0.2223
dipole: 0.3128
quadrupole: -56.4679 -71.8382 -80.1893
quadrupole: -1.7836 0.1642 -0.2385
quadrupole: 13.0306 -2.3397 -10.6909 -1.7836 0.1642 -0.2385
hfenergy: -533.9449643 hartree
pointgroup: C01 [X(C11H10N2)]
dipole: -0.0207881 0.0334667 0.1165891 debye
dipolederiv: -0.4211917 -0.0200714 -0.0132326 0.0388688 -0.3115979 -0.0543366 -0.0029394 -0.0556153 -0.2552641 -0.4484476 -0.0195898 -0.0053584 -0.0449663 -0.3058902 -0.0490191 -0.0029195 -0.0480987 -0.2151974 0.4645998 0.0222498 0.0267294 -0.163388 -0.0170808 -0.0141106 -0.0949728 -0.0144453 -0.0001702 -0.3389635 0.1714193 0.0961671 0.1670313 0.2301043 0.1212592 0.0988621 0.1125679 0.1031062 0.6408128 -0.0079157 -0.0105738 -0.155299 0.0978747 0.0269353 -0.0589787 0.0275691 0.0389631 0.2204424 -0.1743085 -0.095569 -0.0117079 -0.0044129 0.0809984 -0.0050919 0.0790639 -0.1007479 0.0901595 -0.1927698 -0.1193135 -0.0966482 -0.1077978 -0.0598769 -0.0580842 -0.0512767 -0.0173929 -0.459119 0.1013603 0.0409629 0.2215237 -0.0686692 0.0057557 0.0923718 0.0149725 -0.0834586 0.0123304 0.0601145 0.0378684 -0.1992373 -0.1470791 -0.0252476 -0.1141819 -0.0155096 -0.1223324 -0.0236727 0.0228076 0.0112614 0.2525153 0.2257706 0.1824328 0.1562886 0.1805396 0.0179437 0.2611988 -0.093796 -0.0401108 -0.0372615 0.1336018 0.1102426 -0.0087731 0.1133336 -0.0859368 -0.0360425 0.063306 0.0288457 -0.2148143 -0.1911392 -0.0269028 -0.089724 -0.0281489 -0.1332591 0.0687418 0.037381 0.0178265 0.3218461 0.2492437 0.1391106 0.125576 0.1404252 -0.024774 0.0177947 0.0673201 0.0365331 0.1113819 -0.0040927 -0.0829303 0.0648185 -0.0858103 0.0911296 -0.1297373 0.1799259 0.1179591 0.0666423 -0.0026627 -0.0681589 0.04895 -0.0742585 0.0532742 0.0566148 0.0202209 -0.0995225 0.026618 0.0529418 0.0358503 -0.0967499 0.0028548 -0.0143739 0.0820765 -0.0765705 0.0546066 -0.0688785 0.01331 0.0260317 0.059724 0.0565815 0.0216831 0.174778 -0.0654639 -0.0215983 -0.0569283 0.044534 -0.045936 -0.0183442 -0.0512344 0.1352055 -0.1297156 -0.036818 -0.0263244 -0.0223459 0.109318 -0.0311178 -0.0195322 -0.0311757 0.1432698 0.0196363 -0.0572367 -0.0353962 -0.1076928 -0.0394157 -0.1023582 -0.0608948 -0.1025389 0.0769281 0.0200163 0.079719 0.0331462 0.1044862 -0.0250845 -0.0721357 0.0415866 -0.0721562 0.1159065 -0.1360083 -0.0119358 -0.0058341 -0.0061457 0.1088791 -0.0241006 -0.0028902 -0.0235796 0.154851 -0.0063041 -0.0693481 -0.0290727 -0.1255998 -0.0406552 -0.0723855 -0.0541008 -0.07406 0.1006465 unknown
polarizability: 206.5019728|1.4791527|120.6013573|2.2227464|33.2737629|72.5944082 unknown
InChI: InChI=1S/C11H10N2/c1-9-5-4-8-13-11(9)10-6-2-3-7-12-10/h2-8H,1H3
charge 0 multiplicity 1
23 atoms
N  -1.186116 -1.09294 -0.890628
N  1.513632 1.117052 0.235058
C  -0.647286 0.005433 -0.255626
C  -1.478144 1.024704 0.324206
C  0.852431 0.009815 -0.238979
C  -2.883096 0.848497 0.199598
C  -0.974165 2.252151 1.055779
C  1.560372 -1.128418 -0.722695
C  -3.428905 -0.271437 -0.457913
C  -2.530867 -1.224699 -0.988026
C  2.967847 -1.123039 -0.713431
C  3.650041 0.017365 -0.225675
C  2.876638 1.106025 0.23352
H  -3.546646 1.607098 0.630643
H  -1.826289 2.832696 1.454464
H  -0.299129 1.982451 1.885123
H  -0.371207 2.896122 0.394398
H  0.979173 -1.974879 -1.094586
H  -4.510629 -0.406557 -0.55544
H  -2.892198 -2.120651 -1.506166
H  3.525613 -1.99163 -1.079805
H  4.74332 0.064917 -0.201088
H  3.359412 2.012421 0.618068
