program: Gaussian 09
title: 000190641
version: EM64L-G09RevD.01
frameworkgroup: C1[X(C17H28NO5P)]
method: RPBEPBE
basis: SDD
operation: Freq
keyword: #p
keyword: freq=noraman
keyword: PBEPBE/SDD
title: #p freq=noraman PBEPBE/SDD
converged: YES YES NO NO
title: Mulliken charges:
elementType: P O O O O O N C C C C C C C C C C C C C C C C C H H H H H H H H H H H H H H H H H H H H H H H H H H H H
charge: 1.362540 -0.546527 -0.483286 -0.592487 -0.281408 -0.308072 -0.806428 0.024783 -0.365925 -0.366881 -0.727889 -0.711958 0.268944 -0.237474 0.113953 -0.335175 0.038772 -0.320403 0.224967 -0.652416 -0.196245 -0.241110 -0.680428 -0.681066 0.185657 0.237012 0.216851 0.231930 0.196950 0.210750 0.222769 0.209390 0.414893 0.214045 0.219450 0.204918 0.221408 0.221433 0.279886 0.234396 0.263112 0.256424 0.230759 0.199044 0.236959 0.235228 0.247604 0.218102 0.221608 0.237065 0.210332 0.223247
chargesum: 0.00000
title: Mulliken charges with hydrogens summed into heavy atoms:
elementType: P O O O O O N C C C C C C C C C C C C C C C C C
charge: 1.362540 -0.546527 -0.483286 -0.592487 -0.281408 -0.308072 -0.391535 0.210440 0.087937 0.062000 -0.084980 -0.073545 0.268944 0.205367 0.113953 -0.055289 0.273167 -0.057291 0.224967 0.033812 0.040714 -0.005883 0.006885 -0.010422
polarizability: 2.60834202e+02 1.84772916e+00 2.49965296e+02 1.85942570e+01 1.88054665e+01 2.02379780e+02
1716.lowfreq: -16.3690 -11.4657 -0.0014 -0.0011 -0.0010 0.9845 9.2823 10.3332 17.3642
frequency: -13.5191 5.0570 16.8386 27.7318 41.1821 49.8958 50.5087 61.3675 73.1549 81.2477 88.5100 95.7306 111.4172 119.5937 152.7314 170.7452 174.8991 194.6443 195.4757 207.8982 218.2489 222.5984 234.8976 243.8587 248.8626 262.3087 278.3149 285.2291 316.4849 342.5747 358.7717 381.9909 391.2451 399.2194 406.2440 406.3009 437.9027 454.9780 459.3724 485.1739 508.1860 525.4365 562.9498 605.5243 633.5908 654.2586 685.1625 751.4704 758.5230 763.0633 770.3107 786.7564 788.0532 794.9915 803.6500 809.8540 850.0758 875.4960 884.5790 895.9403 900.8375 925.8478 933.3093 942.8678 965.2335 966.2210 988.8348 994.0272 1009.6574 1034.1638 1048.2930 1049.1414 1057.2647 1096.0099 1099.7054 1107.0403 1126.3737 1137.9939 1144.5354 1147.4056 1157.1307 1170.0624 1174.4699 1181.6934 1203.1973 1238.4165 1245.1873 1266.6682 1270.3858 1271.5150 1297.9715 1320.0173 1326.8169 1336.3124 1346.6693 1349.3875 1358.0649 1379.0367 1381.0696 1382.8489 1387.0118 1390.3496 1398.1790 1425.8542 1456.4206 1457.8529 1458.6023 1460.8162 1465.3859 1466.9517 1470.4370 1473.1150 1473.9572 1475.7567 1480.4960 1484.4061 1486.6417 1488.2222 1489.3016 1567.6323 1585.7386 1607.8831 2954.0196 2970.0564 2971.0913 2973.2246 2975.9842 2987.7170 2990.4380 2994.8091 2995.9033 3025.7821 3034.2342 3038.8094 3060.5686 3065.1995 3067.5303 3072.4687 3079.1105 3084.6735 3085.7718 3094.8363 3100.2465 3105.3511 3114.9579 3139.7229 3156.0356 3170.4540 3179.1947 3320.1041
redmass: 2.5484 3.6475 4.5836 3.1647 3.5594 3.3305 3.2204 3.9514 2.6903 3.5079 4.3909 3.5552 4.6780 4.9944 3.0146 5.2480 3.5473 1.2798 2.1038 1.1636 4.3148 1.4419 1.2098 1.3981 2.1419 3.4379 3.1855 2.9788 5.6907 5.2697 3.3937 4.0578 3.0597 4.0671 3.1099 3.5428 3.7921 3.2716 3.2880 3.9252 3.6154 4.4975 4.7702 7.6310 6.1305 6.0987 5.1517 1.5085 2.0565 2.1620 1.8639 2.2102 1.8345 4.7132 1.2332 2.2761 6.1772 3.5319 1.4725 1.5720 2.7656 1.2126 1.6061 1.3626 1.3782 1.2047 1.7367 1.3381 2.8144 3.0519 3.4000 3.2646 7.3012 2.2011 1.7165 4.4731 1.8675 2.1441 1.7595 1.9240 2.0604 1.8997 1.0781 1.9534 3.3507 1.4281 2.3914 1.1478 1.3096 1.3642 1.1778 1.2314 1.5649 1.3365 1.5099 1.2423 1.3649 8.8880 1.2852 1.2190 1.2344 1.2024 1.2325 2.2067 1.0487 1.0575 1.0706 1.1902 1.0514 1.0691 1.9280 1.0984 1.1784 1.0471 1.0675 1.0589 1.0497 1.0602 1.0477 7.1948 7.9168 6.8015 1.0806 1.0428 1.0585 1.0402 1.0548 1.0385 1.0356 1.0360 1.0582 1.0986 1.0866 1.1028 1.0991 1.1051 1.0993 1.0996 1.0981 1.0965 1.0993 1.0988 1.1008 1.1004 1.1024 1.0864 1.0909 1.0950 1.0998 1.0808
irintensity: 1.2185 0.4102 0.7095 0.1279 0.3249 0.9844 1.6706 1.2891 0.4869 1.3852 1.1535 0.0523 4.1950 2.3779 0.2532 1.7249 4.4408 0.4359 1.7473 0.1897 5.6175 1.2306 1.4913 1.3059 2.0098 9.1262 6.2519 2.5063 17.7357 7.1965 1.1035 10.2734 18.0077 12.1148 7.5840 13.1600 17.3926 12.5421 2.7993 41.4424 14.8189 2.2354 5.2839 28.7921 97.7446 38.1154 20.1681 66.6462 31.6025 112.9642 49.3911 55.9057 27.1724 50.9457 46.3587 30.3998 126.5606 147.5387 5.8614 6.0526 19.7713 2.7021 19.1972 0.0997 2.3700 6.2461 9.1601 1.2391 109.8644 92.6454 184.0029 127.6435 33.4340 3.7077 108.0247 142.2780 32.0811 2.2858 6.2572 24.9643 11.9692 7.4887 8.3722 38.0442 111.7080 104.7253 280.2587 1.9285 14.2486 8.7641 3.6893 0.9621 11.6409 3.9455 0.7566 9.9752 2.8668 6.6015 32.7269 19.2192 25.7662 16.3201 18.0613 20.3533 10.3301 16.6169 8.0582 82.3575 1.8348 6.6248 75.9633 41.4534 22.7849 15.5943 13.6089 22.8667 17.9405 14.2916 3.7971 57.8824 122.1168 172.6538 10.0581 24.7474 21.3681 52.5631 46.0118 24.9047 14.5400 23.0141 29.9361 10.7356 4.5486 11.1604 32.9529 15.6380 76.3773 50.1080 41.8090 25.8738 6.1972 49.2627 14.6600 34.0806 31.4023 3.4430 14.0675 3.2717 13.2568 456.5060
temp: 298.150 k
press: 1.00000 atm
elementType: 15 8 8 8 8 8 7 6 6 6 6 6 6 6 6 6 6 6 6 6 6 6 6 6 1 1 1 1 1 1 1 1 1 1 1 1 1 1 1 1 1 1 1 1 1 1 1 1 1 1 1 1
symmnumber: 1
zpe: 1124801.2 jmol-1
zpe.correction: 0.428414 hartree
zpe.thermalcorrener: 0.456119 hartree
zpe.thermalcorrenthalpy: 0.457063 hartree
zpe.thermalcorrgfe: 0.366714 hartree
zpe.sumelectzpe: -1434.835242 hartree
zpe.sumelectthermal: -1434.807538 hartree
zpe.sumelectthermalent: -1434.806593 hartree
zpe.sumelectthermalfe: -1434.896943 hartree
dipole: -4.6075 5.0790 -0.9972
dipole: 6.9296
quadrupole: -144.6847 -148.6685 -146.5713
quadrupole: 6.5278 2.8776 6.2473
quadrupole: 1.9568 -2.0270 0.0702 6.5278 2.8776 6.2473
hfenergy: -1435.2636565 hartree
pointgroup: C01 [X(C17H28N1O5P1)]
dipole: -2.0256064 1.423521 -1.1416408 debye
polarizability: 258.4582708|9.3117958|258.6799894|16.5865142|-2.0710282|196.0410182 unknown
InChI: InChI=1S/C17H28NO5P/c1-6-14(5)12-18-24(20,21-7-2)23-16-11-9-8-10-15(16)17(19)22-13(3)4/h8-11,13-14,18H,6-7,12H2,1-5H3
charge 0 multiplicity 1
52 atoms
P  1.867176 -0.818097 0.878512
O  0.135191 -0.87822 1.315233
O  2.373942 0.155517 2.206829
O  2.691081 -2.171146 0.820288
O  -3.216178 0.846555 -0.448934
O  -0.91638 1.167236 -0.454666
N  1.732851 0.060839 -0.575959
C  3.587426 1.252589 -1.851629
C  2.706493 -0.016463 -1.681739
C  4.543876 1.435912 -0.645237
C  4.349005 1.16076 -3.195375
C  5.275237 2.795919 -0.618049
C  -0.777509 -1.684486 0.616377
C  1.727824 1.475951 2.480767
C  -1.855749 -1.077348 -0.093168
C  -0.688164 -3.091539 0.723543
C  -3.420441 2.308069 -0.784132
C  -2.869433 -1.914329 -0.635746
C  -1.909495 0.392868 -0.329908
C  0.7607 1.353787 3.658774
C  -1.683492 -3.903345 0.142128
C  -2.784651 -3.315491 -0.527041
C  -3.316711 2.482125 -2.305643
C  -4.791281 2.659928 -0.204112
H  2.90658 2.130606 -1.890512
H  3.353087 -0.900181 -1.515691
H  2.144592 -0.200273 -2.619477
H  3.964355 1.322456 0.291849
H  5.286876 0.611504 -0.651896
H  5.032814 0.289641 -3.197889
H  4.955695 2.064627 -3.379704
H  3.651928 1.047057 -4.04728
H  0.857796 0.602748 -0.690455
H  5.940482 2.924801 -1.49133
H  5.898708 2.890517 0.289959
H  4.551812 3.634025 -0.619359
H  1.21757 1.848268 1.571119
H  2.57541 2.14379 2.714815
H  0.156534 -3.525153 1.267744
H  -2.610309 2.86695 -0.280784
H  -3.710483 -1.445049 -1.153912
H  -0.0749 0.681595 3.403814
H  1.281517 0.952694 4.54494
H  0.353345 2.350831 3.915186
H  -1.606074 -4.992959 0.222686
H  -3.565971 -3.946117 -0.962992
H  -2.31424 2.199833 -2.668737
H  -3.49274 3.539959 -2.573716
H  -4.073807 1.864534 -2.820501
H  -4.816859 2.478251 0.883571
H  -5.011662 3.727315 -0.386128
H  -5.584176 2.054942 -0.677828
