program: Gaussian 09
title: 000190644
version: EM64L-G09RevD.01
frameworkgroup: C1[X(C17H28NO5P)]
method: RPBEPBE
basis: SDD
operation: Freq
keyword: #p
keyword: freq=noraman
keyword: PBEPBE/SDD
title: #p freq=noraman PBEPBE/SDD
converged: NO YES NO NO
title: Mulliken charges:
elementType: P O O O O O N C C C C C C C C C C C C C C C C C H H H H H H H H H H H H H H H H H H H H H H H H H H H H
charge: 1.352668 -0.544863 -0.475729 -0.594187 -0.284527 -0.303892 -0.891622 0.370405 -0.341324 -0.748897 -0.710998 -0.725041 0.248949 -0.242150 0.111086 -0.319035 -0.648440 -0.320814 0.228521 -0.199682 0.039662 -0.240344 -0.682435 -0.680914 0.187181 0.240294 0.442970 0.225737 0.214469 0.222285 0.217638 0.210834 0.250499 0.210363 0.217850 0.230573 0.218888 0.221900 0.279659 0.199999 0.256015 0.230102 0.264739 0.236228 0.234285 0.234488 0.222741 0.210098 0.237126 0.221386 0.217408 0.247852
chargesum: 0.00000
title: Mulliken charges with hydrogens summed into heavy atoms:
elementType: P O O O O O N C C C C C C C C C C C C C C C C C
charge: 1.352668 -0.544863 -0.475729 -0.594187 -0.284527 -0.303892 -0.448651 0.370405 0.086151 -0.086407 -0.032027 -0.066256 0.248949 0.198637 0.111086 -0.039375 0.037676 -0.056075 0.228521 0.036546 0.273947 -0.005857 -0.012470 0.005731
polarizability: 2.58035268e+02 -1.44035231e-01 2.46936250e+02 1.27369143e+01 -2.19298839e+01 2.03887795e+02
1716.lowfreq: -42.8682 -7.8016 -5.1524 -3.8626 -0.0019 -0.0018 -0.0016 12.4108 19.8150
frequency: -39.6074 12.2110 19.7653 24.2059 41.5209 48.8051 59.0582 63.4915 82.6974 92.3027 100.5049 105.6846 116.3522 144.5996 155.2694 170.1022 181.1340 191.2993 195.2704 208.7358 213.9357 225.9862 230.2069 241.3938 262.8561 263.8248 277.5379 287.4518 315.4022 325.6824 343.0247 357.6285 383.4315 390.0458 397.7176 408.9364 427.7868 433.5109 458.3314 468.6994 502.2769 515.4042 526.9114 560.4761 606.9265 636.2120 655.2139 684.0152 693.8961 753.7528 761.1047 770.5737 774.7820 785.6676 795.1886 806.1487 830.7374 849.5552 870.9532 883.1249 900.4646 900.6381 926.0489 929.1857 944.2058 965.0708 978.4914 989.9856 993.2008 1006.1968 1012.0322 1035.0377 1048.1429 1051.8192 1069.6825 1070.7259 1094.6733 1099.5843 1127.1942 1146.0307 1157.1753 1174.8746 1181.6045 1193.4551 1196.3276 1203.6287 1229.5689 1242.9880 1264.7658 1271.8985 1292.1609 1326.9166 1335.2609 1342.3000 1343.0836 1371.2095 1379.0948 1380.5113 1383.5589 1388.9888 1391.5925 1396.1954 1425.6868 1448.0292 1454.5017 1455.3923 1456.9882 1463.6118 1465.3290 1468.1287 1469.9672 1471.5041 1472.9750 1474.6963 1477.6606 1483.2603 1486.2005 1488.4055 1492.6870 1567.4764 1585.6022 1608.0062 2973.9874 2976.5174 2977.7499 2983.4193 2985.4899 2989.6415 2990.3192 2993.5745 3032.4248 3032.8478 3065.9736 3070.1238 3074.9025 3076.5170 3080.5604 3082.1115 3084.4415 3085.1833 3088.6850 3093.9373 3099.0129 3103.8901 3112.7212 3139.3648 3156.5950 3173.5929 3180.6303 3272.2182
redmass: 3.0380 4.1678 3.3361 3.0477 3.3074 3.5634 3.3470 3.9419 4.4234 2.3232 3.9480 4.8699 4.4430 2.5314 3.1496 4.6615 5.0619 1.0327 1.2444 3.8536 1.2869 1.2053 1.3034 2.1435 2.9459 1.1775 4.5196 3.4154 5.9163 2.8270 3.3881 3.2516 3.8709 3.8457 4.0558 3.9593 3.6511 3.7115 3.2085 3.6982 3.5561 3.6169 4.5569 4.7805 7.6509 6.4730 6.4739 5.0912 2.9775 1.5039 3.6367 1.8897 1.2292 2.4064 5.6604 1.1290 2.2358 6.1734 3.0437 1.4621 2.6612 2.2233 1.2085 1.4689 1.3721 1.3851 2.4033 1.4330 1.3405 1.5248 2.9433 3.3316 3.3439 1.9979 3.0568 3.0111 2.1507 1.7217 1.8953 1.5322 2.0618 1.0846 1.9509 2.7820 2.4200 2.5748 3.1545 3.0455 1.1296 1.4729 1.3531 1.5348 1.3631 1.3735 1.2515 1.2205 6.2796 1.3659 1.2159 1.2291 1.2203 1.2313 2.1981 1.1123 1.0606 1.0820 1.0540 1.0585 1.0523 1.1488 1.5102 1.1088 1.1703 1.1500 1.0523 1.0611 1.0511 1.0569 1.0655 7.2085 7.9728 6.7848 1.0535 1.0372 1.0388 1.0376 1.0493 1.0355 1.0495 1.0359 1.1006 1.0866 1.1026 1.1002 1.0992 1.1001 1.0991 1.1003 1.0967 1.0994 1.0994 1.0988 1.1008 1.1005 1.1022 1.0866 1.0914 1.0946 1.0994 1.0814
irintensity: 0.1671 0.8148 0.1046 1.7464 0.0789 1.2570 2.7788 0.7157 0.9517 1.1109 0.0586 1.6041 2.3198 4.1333 7.3020 0.3159 1.9703 0.0219 0.5671 2.5513 0.1267 0.9998 0.6838 2.3647 8.8721 0.4269 6.7923 8.0965 13.8908 3.4226 5.3178 0.2210 10.6268 8.2389 14.8019 10.7024 10.1837 19.5032 2.7247 15.8477 17.6694 27.1476 9.0721 5.1573 52.6926 108.4669 50.0475 24.2578 10.3635 64.8266 36.4242 55.4866 32.9836 15.3284 42.0653 11.2904 22.3872 112.7633 109.3569 2.8375 28.4448 63.0812 2.4724 0.5495 0.1250 0.8568 91.4559 29.5330 2.1105 15.9829 107.2416 112.1879 246.9779 22.5211 50.7129 24.1682 9.7931 99.2217 35.6427 7.7038 12.4650 12.7652 41.3222 78.9543 72.7119 31.6438 78.9803 343.3592 0.3266 17.6125 12.3274 11.4012 3.4747 15.3162 3.6043 20.2305 9.0828 29.3478 14.4087 24.7100 33.9061 18.0752 18.4069 58.5411 10.2379 20.9837 3.8603 3.6866 3.1686 21.8346 64.8458 55.5340 16.9549 4.6212 10.4135 6.7059 13.3114 8.3481 11.1716 57.7745 125.5208 181.2283 19.1060 19.8454 40.2737 21.6929 23.6158 14.4088 34.8282 24.2995 3.3465 4.6398 14.0776 26.6594 29.3560 45.6919 35.7097 4.4724 28.7656 5.2921 78.7697 51.0878 15.1569 34.5073 30.1625 3.7617 15.6569 3.9273 10.7244 497.1027
temp: 298.150 k
press: 1.00000 atm
elementType: 15 8 8 8 8 8 7 6 6 6 6 6 6 6 6 6 6 6 6 6 6 6 6 6 1 1 1 1 1 1 1 1 1 1 1 1 1 1 1 1 1 1 1 1 1 1 1 1 1 1 1 1
symmnumber: 1
zpe: 1121005.2 jmol-1
zpe.correction: 0.426968 hartree
zpe.thermalcorrener: 0.454839 hartree
zpe.thermalcorrenthalpy: 0.455783 hartree
zpe.thermalcorrgfe: 0.366770 hartree
zpe.sumelectzpe: -1434.841440 hartree
zpe.sumelectthermal: -1434.813569 hartree
zpe.sumelectthermalent: -1434.812625 hartree
zpe.sumelectthermalfe: -1434.901638 hartree
dipole: -5.0480 -3.7634 -0.3276
dipole: 6.3050
quadrupole: -148.4512 -142.5939 -146.8716
quadrupole: -7.9080 2.2629 -5.9831
quadrupole: -2.4790 3.3784 -0.8993 -7.9080 2.2629 -5.9831
hfenergy: -1435.268408 hartree
pointgroup: C01 [X(C17H28N1O5P1)]
dipole: -1.8269384 0.4074986 1.6277048 debye
polarizability: 247.3269275|17.0100482|245.5900726|-19.853019|21.6002268|215.9423133 unknown
InChI: InChI=1S/C17H28NO5P/c1-7-17(5,6)18-24(20,21-8-2)23-15-12-10-9-11-14(15)16(19)22-13(3)4/h9-13,18H,7-8H2,1-6H3
charge 0 multiplicity 1
52 atoms
P  2.130208 0.428783 -1.223948
O  0.39377 0.235178 -1.615622
O  2.440703 1.872243 -2.111591
O  3.106967 -0.728335 -1.701777
O  -3.038241 -0.030281 0.759274
O  -0.877262 0.800497 0.914374
N  1.948977 0.757544 0.442147
C  3.022874 0.593871 1.471231
C  3.295361 -0.919872 1.761302
C  2.516982 1.333735 2.733941
C  4.330155 1.254436 0.965498
C  2.073232 -1.7281 2.24154
C  -0.268266 -0.994275 -1.469391
C  1.806473 3.164993 -1.720372
C  -1.372489 -1.097364 -0.570519
C  0.088217 -2.084257 -2.297497
C  0.53204 3.420388 -2.528732
C  -2.142437 -2.293677 -0.574568
C  -1.694718 -0.01973 0.405936
C  -0.666303 -3.27418 -2.254855
C  -3.484996 0.945605 1.825587
C  -1.79331 -3.376506 -1.403282
C  -4.973909 1.170874 1.557684
C  -3.177858 0.345032 3.20456
H  4.105467 -0.981135 2.516116
H  3.687408 -1.371829 0.829337
H  0.960831 0.840989 0.750698
H  1.537989 0.946115 3.068748
H  3.238719 1.205717 3.560695
H  2.405781 2.413446 2.529137
H  4.165156 2.323104 0.739125
H  5.117409 1.176606 1.73688
H  4.702394 0.75373 0.052405
H  1.693268 -1.371988 3.21696
H  2.33891 -2.794679 2.356452
H  1.249243 -1.668026 1.506971
H  1.610131 3.161445 -0.629864
H  2.587617 3.912241 -1.943237
H  0.949804 -1.978609 -2.963317
H  0.125959 4.419565 -2.279086
H  -0.232319 2.658243 -2.304373
H  0.748479 3.393042 -3.610332
H  -3.004913 -2.358861 0.094539
H  -0.381143 -4.11617 -2.894811
H  -2.90058 1.871898 1.675516
H  -2.389053 -4.294637 -1.383757
H  -5.537556 0.227012 1.661159
H  -5.378573 1.899819 2.282853
H  -5.135388 1.563891 0.539718
H  -3.703542 -0.617261 3.336578
H  -3.518018 1.036591 3.996958
H  -2.094348 0.183634 3.332808
