program: Gaussian 09
title: 000182453
version: EM64L-G09RevD.01
frameworkgroup: C1[X(C14H21NO4)]
method: RPBEPBE
basis: SDD
operation: Freq
keyword: #p
keyword: freq=noraman
keyword: PBEPBE/SDD
title: #p freq=noraman PBEPBE/SDD
converged: YES YES NO NO
title: Mulliken charges:
elementType: O O O O N C C C C C C C C C C C C C C H H H H H H H H H H H H H H H H H H H H H
charge: -0.470673 -0.270094 -0.273212 -0.441736 -0.352527 -0.036963 -0.149945 -0.557006 -0.576112 0.179321 0.154667 0.165535 0.167905 -0.364087 -0.393411 -0.393398 -0.341392 -0.533721 -0.533278 0.218599 0.226840 0.247200 0.247888 0.234235 0.248657 0.278383 0.197862 0.202538 0.343119 0.236498 0.237341 0.209388 0.204393 0.218130 0.217770 0.241522 0.218974 0.217678 0.241435 0.331678
chargesum: 0.00000
title: Mulliken charges with hydrogens summed into heavy atoms:
elementType: O O O O N C C C C C C C C C C C C C C
charge: -0.127555 -0.270094 -0.273212 -0.110057 -0.074145 0.181636 0.076895 -0.061918 -0.093221 0.179321 0.154667 0.165535 0.167905 0.036314 -0.156913 -0.156057 0.072389 0.143701 0.144809
polarizability: 2.18160611e+02 9.80197310e+00 2.02483634e+02 3.23345178e+00 -4.73182503e-03 1.06450779e+02
1716.lowfreq: -9.0619 -3.1324 -0.0004 -0.0002 0.0008 5.8597 26.6046 46.4670 52.5287
frequency: 26.6006 46.4524 52.5078 67.0400 81.4208 91.5017 106.9432 132.6803 147.5031 161.0541 175.2669 185.9144 222.4966 236.1197 251.9674 262.0194 270.4530 277.0381 312.3395 316.2623 320.2257 358.6881 374.5695 382.4322 415.2372 444.0887 480.9759 512.5344 526.1165 544.9242 569.3523 598.0159 637.2369 684.8410 697.4936 735.5065 758.8191 785.9927 816.6242 825.1081 893.5547 895.0372 912.9115 927.7401 963.2998 979.6398 1014.3830 1040.2354 1044.7092 1050.6543 1056.5719 1077.5000 1087.8477 1110.3762 1113.6101 1114.8728 1139.6144 1142.6234 1157.6304 1158.9868 1181.6691 1192.7067 1193.8301 1200.1552 1228.3236 1231.9078 1251.1410 1272.2073 1285.0627 1296.1103 1303.1594 1313.0029 1326.3628 1348.7645 1360.7727 1384.3240 1390.1344 1411.9734 1432.1078 1436.5200 1444.4840 1461.0555 1464.1975 1466.1550 1466.1905 1470.2500 1473.3232 1475.2610 1480.2840 1482.3191 1493.4348 1599.4619 1609.0677 2852.0194 2880.2069 2953.0909 2954.5431 2963.9857 2978.7167 2979.6367 2980.8467 2988.5703 3032.0740 3038.5599 3039.7269 3046.1708 3069.0833 3119.3793 3119.6110 3151.3630 3172.0036 3421.4888 3561.9177 3577.8753
redmass: 5.1618 4.7947 2.0334 2.7882 3.1237 3.5272 4.0327 3.4124 3.4144 4.0106 3.3290 2.8808 4.6420 1.0813 1.6707 1.1735 2.2991 1.9217 3.3270 2.5082 1.6046 3.0039 6.0686 4.7954 5.1023 3.7839 2.9708 4.2059 4.7269 3.7042 3.9872 3.2267 4.2004 6.1684 4.0679 2.7225 1.6109 1.4919 1.1756 2.2701 1.3902 2.7169 4.8150 2.4398 4.4130 5.5927 3.9780 2.4196 2.5592 4.9571 3.6592 1.8686 2.1450 1.6865 1.2628 1.2647 1.1921 1.4248 1.4259 3.1427 1.3062 1.5940 1.6004 1.4646 2.4533 1.6987 2.6122 1.2095 1.2530 1.3370 1.6230 1.3529 1.4050 1.3488 1.4662 1.5073 4.0089 1.6563 1.2603 1.3548 1.6563 1.0867 1.6129 1.0722 1.0526 1.2058 1.1703 1.0935 1.2771 1.3972 1.1058 8.2067 6.9179 1.0802 1.0688 1.0330 1.0332 1.0838 1.0671 1.0634 1.0635 1.0855 1.0987 1.1036 1.1036 1.0947 1.1015 1.0990 1.0990 1.0866 1.0954 1.0734 1.0662 1.0663
irintensity: 0.1087 0.6023 2.5237 7.0079 1.5157 0.7636 2.3684 9.6735 12.2303 1.0924 0.6401 2.4064 2.2079 0.0501 28.9651 2.9227 61.7448 48.6071 10.1447 23.5437 137.7759 2.1408 5.6771 0.4803 12.2925 11.6775 1.8656 23.8394 0.5461 8.2375 9.1289 2.5368 15.3449 23.2830 13.6998 15.9430 64.9575 63.3670 4.2045 0.7303 0.0072 3.2422 11.1104 9.5226 104.5758 65.3790 56.0756 10.7761 39.2927 64.1510 88.9462 31.4725 1.6612 23.3156 0.3890 0.2687 26.3879 2.4441 3.9049 93.1967 16.0750 16.3338 0.3053 23.2103 198.5411 45.0550 4.8300 1.1681 0.2676 24.3231 2.4186 5.2840 21.9424 11.3279 6.9942 12.3447 7.5494 2.2562 49.3297 1.5050 1.5860 5.2763 243.1394 15.7360 22.2144 12.9116 1.3986 9.7419 1.7997 1.0962 3.8543 7.8482 14.9534 56.1179 91.6151 66.2941 91.5104 28.4999 59.0201 12.2292 26.0288 40.4268 18.7523 45.1994 56.7889 20.1773 42.9596 46.2234 2.9415 10.6173 15.6239 9.8817 7.3545 6.2733
temp: 298.150 k
press: 1.00000 atm
elementType: 8 8 8 8 7 6 6 6 6 6 6 6 6 6 6 6 6 6 6 1 1 1 1 1 1 1 1 1 1 1 1 1 1 1 1 1 1 1 1 1
symmnumber: 1
zpe: 873756.9 jmol-1
zpe.correction: 0.332796 hartree
zpe.thermalcorrener: 0.352970 hartree
zpe.thermalcorrenthalpy: 0.353914 hartree
zpe.thermalcorrgfe: 0.283707 hartree
zpe.sumelectzpe: -900.210573 hartree
zpe.sumelectthermal: -900.190399 hartree
zpe.sumelectthermalent: -900.189455 hartree
zpe.sumelectthermalfe: -900.259662 hartree
dipole: -5.7696 1.6201 0.8536
dipole: 6.0533
quadrupole: -118.0340 -92.6554 -117.3269
quadrupole: 3.4415 5.2366 -3.4341
quadrupole: -8.6953 16.6833 -7.9881 3.4415 5.2366 -3.4341
hfenergy: -900.5433691 hartree
pointgroup: C01 [X(C14H21N1O4)]
dipole: 2.2437295 0.7227223 -0.3392434 debye
polarizability: 218.854209|-8.5040719|200.9812833|6.6265029|-7.4432128|107.2595328 unknown
InChI: InChI=1S/C14H21NO4/c1-18-13-3-4-14(19-2)10-8-12(17)11(7-9(10)13)15-5-6-16/h3-4,11-12,15-17H,5-8H2,1-2H3
charge 0 multiplicity 1
40 atoms
O  -1.550463 -3.30502 -0.005002
O  0.220651 2.873908 -0.409018
O  3.310602 -1.753469 0.434159
O  -6.514298 0.403447 0.384269
N  -3.08627 -1.044511 -0.298224
C  -1.692721 -0.902094 0.177112
C  -0.855365 -2.056633 -0.392548
C  -1.077983 0.439617 -0.283133
C  0.574444 -2.030771 0.171497
C  0.432954 0.506304 -0.122279
C  1.213972 -0.653753 0.083412
C  1.082566 1.77572 -0.19326
C  2.628424 -0.533955 0.224395
C  -4.079083 -0.163702 0.34696
C  2.479603 1.885901 -0.055056
C  3.25887 0.722969 0.154835
C  -5.471922 -0.409245 -0.263521
C  0.829627 4.201527 -0.468685
C  4.764837 -1.692025 0.570417
H  -1.621176 -0.966718 1.294021
H  -0.841377 -1.968269 -1.500699
H  -1.531169 1.284369 0.265542
H  -1.352723 0.593104 -1.346543
H  1.215918 -2.765266 -0.35204
H  0.535997 -2.360749 1.229432
H  -3.356608 -2.037303 -0.230997
H  -3.792474 0.892664 0.16807
H  -4.145354 -0.299519 1.454702
H  -1.058788 -4.078917 -0.377046
H  2.978992 2.857383 -0.107926
H  4.34291 0.820509 0.261771
H  -5.794644 -1.450811 -0.089596
H  -5.433206 -0.231632 -1.357909
H  1.546879 4.279516 -1.309627
H  1.344869 4.453865 0.479361
H  -0.007161 4.897081 -0.631636
H  5.062419 -1.084974 1.448157
H  5.239983 -1.278944 -0.341439
H  5.086776 -2.734022 0.715951
H  -6.311412 1.361116 0.23382
