program: Gaussian 09
title: 000190577
version: EM64L-G09RevD.01
frameworkgroup: C1[X(C17H14BrNO4)]
method: RPBEPBE
basis: SDD
operation: Freq
keyword: #p
keyword: freq=noraman
keyword: PBEPBE/SDD
title: #p freq=noraman PBEPBE/SDD
converged: YES YES NO NO
title: Mulliken charges:
elementType: Br O O O O N C C C C C C C C C C C C C C C C C H H H H H H H H H H H H H H
charge: 0.020214 -0.254992 -0.260848 -0.258798 -0.242814 -0.008108 -0.377036 0.357630 -0.153028 0.458183 0.219228 -0.162567 -0.380694 -0.100977 -0.397314 -0.362211 -0.301990 -0.209313 0.320974 0.323170 -0.369749 -0.757740 -0.758007 0.289642 0.277063 0.284825 0.251622 0.267974 0.286385 0.234352 0.244206 0.251754 0.250660 0.260569 0.255869 0.250638 0.251229
chargesum: 0.00000
title: Mulliken charges with hydrogens summed into heavy atoms:
elementType: Br O O O O N C C C C C C C C C C C C C C C C C
charge: 0.020214 -0.254992 -0.260848 -0.258798 -0.242814 -0.008108 -0.087395 0.357630 0.124035 0.458183 0.219228 0.122258 -0.380694 -0.100977 -0.145692 -0.094237 -0.015605 0.025039 0.320974 0.323170 -0.125543 0.005243 -0.000271
polarizability: 2.98641928e+02 2.95947980e+00 2.43688360e+02 -2.62700671e+01 4.28711514e+00 1.55133722e+02
1716.lowfreq: -53.4118 -44.0811 -5.4484 -0.0007 -0.0006 -0.0005 2.8401 6.9830 22.2413
frequency: -53.4007 -44.0780 22.1966 37.0104 48.2205 55.3524 58.9675 66.9946 75.8541 125.5470 133.7389 167.7330 181.4021 194.8956 201.5238 218.2021 253.6748 271.0387 277.8903 324.9657 376.5845 412.1360 419.3314 446.7524 462.6503 492.2599 497.3640 535.0747 548.9934 567.8529 573.5961 587.2022 591.8094 603.9062 616.3348 641.5985 690.0491 713.1957 746.0969 789.6935 795.7831 824.1211 830.9838 849.9199 855.6025 866.8109 888.4918 902.7948 913.9971 946.0850 948.6456 980.7334 994.3811 997.0996 998.9052 1003.5255 1041.2631 1046.0219 1046.4379 1053.8306 1126.9890 1153.6605 1177.3476 1183.0872 1193.6125 1222.8365 1233.4967 1248.2917 1267.3709 1285.5550 1298.8717 1329.1741 1345.0360 1367.2264 1380.9620 1384.9494 1385.7837 1389.1692 1421.7155 1453.5504 1454.5421 1454.7842 1457.5025 1458.0494 1497.5100 1550.3702 1581.5118 1606.4831 1631.0796 1636.5010 1645.2542 3009.5714 3009.9823 3045.9698 3059.2101 3097.2787 3098.2833 3125.4517 3142.0471 3143.4577 3144.4761 3157.2865 3167.7316 3178.4658 3185.6585
redmass: 1.0556 1.0484 7.0549 10.4782 6.8109 6.5687 3.9529 3.4498 5.7188 4.6593 10.8735 5.4343 6.2647 12.1389 7.1782 5.0805 7.0559 4.2464 6.1790 5.2382 3.6962 5.9649 4.8957 4.2584 4.3490 5.0720 4.3527 4.7344 4.8686 3.5262 3.4855 5.5876 4.0421 5.5470 6.5743 4.7829 5.6028 3.8856 6.3334 4.7305 1.7643 2.3092 4.8906 5.1274 2.5886 1.6902 5.1953 4.9193 5.5239 3.3253 1.5687 3.8068 1.3471 1.8616 1.8174 1.3520 2.4705 1.6395 1.6236 3.2498 1.6000 1.3267 2.8806 2.3163 2.1199 2.0314 1.7309 2.0780 1.2272 1.8610 1.7835 1.8273 2.7345 2.3606 2.8262 1.2484 1.2186 1.8024 3.2299 1.5110 1.1857 1.3893 1.0475 1.0478 3.6123 7.3959 5.8317 6.6520 8.4635 10.6616 10.8645 1.0366 1.0366 1.0846 1.0839 1.0972 1.0972 1.0895 1.1013 1.1010 1.0908 1.0876 1.0993 1.0974 1.0939
irintensity: 1.2964 1.3024 0.0258 0.9344 1.3148 0.3259 2.5315 3.9010 1.7675 0.5597 1.0468 0.7437 6.9822 4.4769 4.7872 1.1301 2.4633 4.8925 1.7943 3.7543 7.9976 6.6629 5.7778 19.6426 7.7390 5.9748 6.5953 3.4588 4.5519 1.0329 3.0170 7.7706 12.6723 3.9677 14.7070 7.0524 3.5695 5.0726 34.5577 5.0941 12.7884 22.6612 12.1640 8.5438 23.1887 60.2180 79.5007 36.1347 224.0802 26.0085 7.0828 53.8330 0.1247 47.1238 26.1118 3.8319 15.5533 4.0542 6.8103 32.3757 5.5302 7.0275 385.7720 243.2135 189.6790 10.9137 7.3124 9.6441 18.7851 22.0372 25.7838 9.9707 5.5354 10.3547 1.8733 67.5005 23.9725 16.9139 5.8571 34.2402 8.0912 6.6548 13.6381 15.1328 44.9740 8.1831 4.9394 4.5533 83.3369 148.3968 167.0689 1.8830 2.4330 10.1141 9.1688 3.8814 4.3141 21.2924 6.9068 4.4794 6.1065 0.0859 23.0251 5.7637 3.5818
temp: 298.150 k
press: 1.00000 atm
elementType: 35 8 8 8 8 7 6 6 6 6 6 6 6 6 6 6 6 6 6 6 6 6 6 1 1 1 1 1 1 1 1 1 1 1 1 1 1
symmnumber: 1
zpe: 712975.9 jmol-1
zpe.correction: 0.271558 hartree
zpe.thermalcorrener: 0.291297 hartree
zpe.thermalcorrenthalpy: 0.292241 hartree
zpe.thermalcorrgfe: 0.220634 hartree
zpe.sumelectzpe: -1023.695193 hartree
zpe.sumelectthermal: -1023.675454 hartree
zpe.sumelectthermalent: -1023.674510 hartree
zpe.sumelectthermalfe: -1023.746117 hartree
dipole: 1.1063 1.6177 0.0203
dipole: 1.9599
quadrupole: -143.5714 -145.7610 -128.9486
quadrupole: 6.8828 7.2168 -1.4925
quadrupole: -4.1444 -6.3340 10.4784 6.8828 7.2168 -1.4925
hfenergy: -1023.9667512 hartree
pointgroup: C01 [X(C17H14Br1N1O4)]
dipole: 0.0310743 0.713739 0.2901782 debye
polarizability: 280.5336869|-24.6867644|243.7000797|-15.3635973|46.2787741|173.2302437 unknown
InChI: InChI=1S/C17H14BrNO4/c1-9(20)22-15-8-13(18)11-5-6-14-12(4-3-7-19-14)16(11)17(15)23-10(2)21/h3-8,15,17H,1-2H3
charge 0 multiplicity 1
37 atoms
Br 1.174734 -3.635553 -2.337509
O  0.85643 1.474982 -1.263873
O  2.214973 -0.5503 1.498568
O  0.630483 3.376744 0.080577
O  4.512678 -0.744589 1.155942
N  -4.227996 -0.284824 0.332802
C  0.744967 0.582242 -0.044755
C  -0.479755 -0.290326 -0.225203
C  2.077146 -0.174203 0.03592
C  -0.348549 -1.564484 -0.83123
C  -1.776229 0.182387 0.18098
C  2.151484 -1.404819 -0.827104
C  1.004658 -2.024475 -1.211757
C  -2.939771 -0.658742 -0.032425
C  -1.512332 -2.376333 -1.038374
C  -2.773291 -1.93727 -0.64899
C  -2.007846 1.463668 0.793554
C  -3.305033 1.827614 1.155602
C  0.795932 2.861725 -1.049881
C  3.527682 -0.811639 1.924995
C  -4.386036 0.921624 0.908542
C  0.949065 3.610642 -2.353494
C  3.559459 -1.161631 3.395597
H  0.668033 1.235885 0.840969
H  2.913475 0.50637 -0.205449
H  3.141854 -1.775473 -1.099312
H  -1.396612 -3.357392 -1.507272
H  -3.668451 -2.547645 -0.798071
H  -1.181141 2.159319 0.968245
H  -3.506265 2.79598 1.623857
H  -5.410634 1.193382 1.189874
H  0.067415 4.2562 -2.508627
H  1.831398 4.271389 -2.29247
H  1.059177 2.920196 -3.201207
H  2.548069 -1.186598 3.824971
H  4.173069 -0.41827 3.933916
H  4.045857 -2.143586 3.525791
