program: Gaussian 09
title: 000182444
version: EM64L-G09RevD.01
frameworkgroup: C1[X(C22H26O7)]
method: RPBEPBE
basis: SDD
operation: Freq
keyword: #pfreq=noraman
keyword: PBEPBE/SDD
title: #p freq=noraman PBEPBE/SDD
converged: NO YES NO NO
title: Mulliken charges:
elementType: O O O O O O O C C C C C C C C C C C C C C C C C C C C C C H H H H H H H H H H H H H H H H H H H H H H H H H H
charge: -0.296600 -0.214158 -0.251192 -0.181256 -0.227652 -0.203106 -0.260950 0.252484 -0.225144 0.340794 0.213746 -0.454785 -0.549892 -0.150416 -0.471565 0.134237 -0.423586 -0.578394 -0.600615 -0.540548 0.128247 -0.132578 -0.737038 0.361683 0.332899 -0.363951 -0.331970 -0.169290 -0.760480 0.228241 0.233777 0.212766 0.219246 0.271361 0.234780 0.255204 0.200982 0.201293 0.218617 0.241488 0.276580 0.240916 0.244132 0.313501 0.256118 0.238724 0.224236 0.226652 0.247806 0.278296 0.272643 0.266984 0.277478 0.242583 0.236672
chargesum: 0.00000
title: Mulliken charges with hydrogens summed into heavy atoms:
elementType: O O O O O O O C C C C C C C C C C C C C C C C C C C C C C
charge: -0.296600 -0.214158 -0.251192 -0.181256 -0.227652 -0.203106 -0.260950 0.252484 0.003097 0.340794 0.213746 -0.008242 -0.059285 0.084364 -0.015379 0.134237 -0.003676 -0.060326 -0.115567 0.029071 0.128247 0.106146 -0.038343 0.361683 0.332899 -0.085655 -0.059327 0.097694 -0.003747
polarizability: 3.13309026e+02 4.24956361e-01 2.06218265e+02 -3.76072895e+00 -5.73246477e+00 2.08905634e+02
1716.lowfreq: -15.1302 -8.1483 -0.0012 -0.0010 -0.0007 2.9841 18.7161 23.9243 31.7075
frequency: 18.6534 23.9102 31.6122 41.2819 53.7256 64.6287 77.4595 83.6374 105.3827 110.3118 112.3803 123.6038 145.5573 156.9318 168.1388 177.6620 190.2008 201.5677 216.6562 231.1933 236.7226 278.0134 291.6071 307.4628 309.1199 321.8357 349.7824 359.4148 381.5183 397.4367 409.9340 424.7970 430.0378 438.8684 462.6315 487.4836 504.6688 530.4224 553.2307 560.6027 582.6621 587.1353 591.7356 609.8050 618.0259 643.7503 657.4436 688.2624 710.2646 722.1857 730.2850 742.4986 755.5952 781.1298 782.6793 796.2263 837.8067 851.1169 860.4529 870.4491 872.7730 878.2282 890.5229 900.4948 910.4253 928.5281 948.5870 951.1739 964.6953 978.8322 982.5052 988.5546 1002.1662 1006.6660 1017.9411 1023.6708 1040.2246 1043.3790 1046.4801 1055.6336 1059.6780 1075.9586 1079.8335 1083.9043 1092.9989 1113.1478 1120.1609 1138.1079 1141.3389 1148.2599 1151.4146 1167.2591 1194.9391 1204.8738 1208.6084 1222.2732 1223.8737 1227.2086 1241.7833 1247.6109 1270.7553 1279.5543 1284.9097 1291.4631 1296.8582 1316.2858 1323.9607 1329.6045 1330.5951 1335.3713 1341.8036 1355.7251 1361.9583 1364.8870 1380.1492 1388.1594 1397.7581 1451.6737 1453.2541 1454.2419 1454.7152 1464.6511 1467.3862 1474.8496 1477.7364 1483.3532 1483.7902 1491.6730 1511.5846 1584.8098 1630.0197 1655.0654 1665.0870 2935.5418 2953.8199 2971.3047 2982.4315 2991.0241 2998.7045 3005.5900 3006.8997 3022.5672 3024.0836 3039.2163 3047.5061 3053.2945 3060.7706 3065.2745 3073.9653 3082.5413 3083.5635 3090.0682 3100.7643 3131.5496 3142.6272 3196.6648 3231.8093 3254.5711 3274.3105
redmass: 5.9568 3.9939 5.7886 4.4198 6.3416 4.1896 5.0902 6.5941 6.7898 4.8246 1.1002 4.5046 3.3355 5.4820 5.0166 5.4754 4.6647 3.4737 1.2414 5.1220 5.0871 2.4576 3.9317 3.3705 3.1894 3.9311 5.7731 3.8582 3.4565 2.9951 4.7878 2.7253 3.5313 3.1011 2.6225 2.9741 3.1747 3.5736 3.2274 3.0755 4.0750 3.9322 3.3325 4.8711 4.2857 3.7710 4.6473 3.0520 4.3134 3.1020 1.5766 4.5685 2.9780 1.6254 4.1966 3.5549 2.5886 5.8750 3.1822 1.8986 1.7321 2.4162 2.0161 2.1497 1.9574 2.1655 1.8671 3.2241 2.7676 2.7048 2.3777 3.9047 2.1507 2.4395 3.1061 2.7356 1.5651 1.9918 2.5015 2.3139 1.8773 2.7819 2.3464 3.0223 2.3261 2.5390 3.0909 2.0421 1.3253 1.5993 2.2194 2.4802 2.8524 1.6999 1.5233 1.2861 1.6276 1.5237 1.4960 1.5013 1.2876 1.2636 1.2265 1.7925 1.4608 1.3399 1.4212 1.5050 1.5645 1.3809 1.6415 1.5427 1.5321 1.3802 1.2557 3.8146 1.2016 1.0726 1.1680 1.0861 1.0802 1.0805 1.0919 1.0677 1.0636 4.3924 1.0924 1.0655 1.0811 6.0950 10.0480 9.1824 11.2308 1.0824 1.0836 1.0643 1.0364 1.0604 1.0848 1.0376 1.0625 1.0587 1.0606 1.0951 1.0969 1.0680 1.0607 1.0967 1.0992 1.1031 1.1013 1.1030 1.0947 1.1043 1.1024 1.1116 1.0932 1.0988 1.1086
irintensity: 0.0884 0.5250 0.4613 0.8323 0.9656 3.0809 8.4087 0.0450 0.3032 0.8031 0.7050 0.9905 2.1638 2.2049 1.0125 7.2568 0.6298 8.8150 0.6563 0.4525 1.7698 2.2071 2.1381 1.0134 7.8367 12.1981 0.7996 4.4998 1.9333 0.9789 3.4698 2.3068 2.9422 8.7260 6.8516 2.8347 4.4947 0.8086 15.9984 1.6026 4.3158 10.1947 6.6249 8.2153 12.8312 10.4631 6.8897 30.0341 3.4714 3.2478 9.5568 18.2620 12.1605 59.5708 20.5186 15.3749 0.5826 38.0905 15.5402 13.0733 18.1434 2.3922 29.2490 12.5188 48.7858 12.3390 11.9306 17.0152 12.8434 23.9092 38.2295 15.4158 121.3833 20.5643 9.8819 20.1252 2.4260 28.3408 42.3650 5.5887 1.8383 84.1672 18.7186 130.4192 5.1262 3.3692 22.2671 36.1152 7.5394 12.5492 54.3733 21.9501 276.4860 38.1391 8.6880 3.8255 10.1176 33.8441 3.8390 1.9695 11.3408 1.8472 6.3369 9.5090 6.0056 2.5895 32.9041 11.0658 8.8700 1.5736 4.3484 13.5457 0.8168 3.8335 82.5108 0.9457 16.4505 24.4749 9.4875 8.3271 33.0354 6.8492 8.8418 15.3885 9.3124 17.7640 23.9014 19.0999 17.2624 5.0955 137.1950 175.5221 208.5494 10.1712 17.1588 33.3363 22.1900 31.4992 19.0069 2.4095 10.5368 8.9745 13.1250 45.5631 37.1361 3.7887 32.6890 36.9372 31.1141 14.0376 10.6616 19.7529 7.8956 21.8555 11.1328 2.9027 0.9621 0.9199 0.0096
temp: 298.150 k
press: 1.00000 atm
elementType: 8 8 8 8 8 8 8 6 6 6 6 6 6 6 6 6 6 6 6 6 6 6 6 6 6 6 6 6 6 1 1 1 1 1 1 1 1 1 1 1 1 1 1 1 1 1 1 1 1 1 1 1 1 1 1
symmnumber: 1
zpe: 1160607.8 jmol-1
zpe.correction: 0.442052 hartree
zpe.thermalcorrener: 0.469163 hartree
zpe.thermalcorrenthalpy: 0.470107 hartree
zpe.thermalcorrgfe: 0.383698 hartree
zpe.sumelectzpe: -1378.264203 hartree
zpe.sumelectthermal: -1378.237092 hartree
zpe.sumelectthermalent: -1378.236148 hartree
zpe.sumelectthermalfe: -1378.322557 hartree
dipole: 5.4348 2.0475 2.9598
dipole: 6.5184
quadrupole: -180.7833 -165.6115 -177.6767
quadrupole: 4.8095 0.3378 4.3389
quadrupole: -6.0928 9.0790 -2.9862 4.8095 0.3378 4.3389
hfenergy: -1378.7062551 hartree
pointgroup: C01 [X(C22H26O7)]
dipole: 2.1524275 -1.3154 -0.4621229 debye
polarizability: 313.2461579|4.6685597|201.8378025|-0.8209546|0.1982493|213.3489644 unknown
InChI: InChI=1S/C22H26O7/c1-13-8-18(24)22(12-27-14(2)23)17(4-3-6-20(22)11-28-20)21(13)9-16(29-19(21)25)15-5-7-26-10-15/h5,7,10,13,16-17H,3-4,6,8-9,11-12H2,1-2H3
charge 0 multiplicity 1
55 atoms
O  -4.166295 -1.423242 -0.379164
O  2.547918 0.865185 1.069106
O  -3.435468 1.422286 0.294344
O  -2.589482 -0.16909 -2.611271
O  0.663503 2.150042 0.812483
O  6.634841 -0.30694 -0.758936
O  -4.47102 0.586216 2.214941
C  -1.78175 -0.320095 -0.254962
C  -0.297333 -0.87237 -0.055068
C  -2.719598 -1.530212 0.039058
C  0.912266 0.034287 -0.534899
C  -0.099674 -1.416145 1.385721
C  -2.554722 -2.130674 1.437998
C  0.613806 0.702968 -1.930256
C  -3.261532 -2.440684 -1.030844
C  -1.842701 0.258303 -1.69537
C  -1.092484 -2.559457 1.696009
C  -0.807313 1.334935 -1.986164
C  2.206211 -0.842811 -0.630785
C  -2.135828 0.846239 0.721067
C  1.296199 1.123773 0.496658
C  3.12453 -0.428461 0.549821
C  1.668694 1.749951 -2.358264
C  4.576018 -0.209379 0.231215
C  -4.556076 1.139532 1.096096
C  5.528615 0.500463 1.068756
C  5.285993 -0.681172 -0.862239
C  6.754191 0.427279 0.438028
C  -5.818502 1.569852 0.394695
H  -0.252873 -1.749989 -0.739322
H  -0.215069 -0.597728 2.122093
H  0.931321 -1.800121 1.503316
H  -3.232788 -2.998717 1.525453
H  -2.89122 -1.402518 2.198312
H  0.631764 -0.129716 -2.666895
H  -3.067039 -2.238219 -2.086425
H  -3.477695 -3.481306 -0.750848
H  -0.844509 -3.433095 1.058462
H  -0.976444 -2.885357 2.746517
H  -0.997052 1.724961 -3.000609
H  -0.86372 2.173976 -1.271346
H  2.716495 -0.649838 -1.588567
H  1.971059 -1.919359 -0.5874
H  -1.407767 1.665493 0.675056
H  -2.228165 0.503429 1.764011
H  3.027682 -1.132148 1.398474
H  2.699594 1.351585 -2.336499
H  1.465629 2.084443 -3.391235
H  1.633339 2.638808 -1.703386
H  5.30186 1.016749 1.999007
H  5.034477 -1.275436 -1.735947
H  7.747609 0.806612 0.657259
H  -6.076483 0.783995 -0.339052
H  -5.664771 2.510207 -0.157751
H  -6.639641 1.671415 1.119256
