program: Gaussian 09
title: 000190580
version: EM64L-G09RevD.01
frameworkgroup: C1[X(C17H15NO5)]
method: RPBEPBE
basis: SDD
operation: Freq
keyword: #p
keyword: freq=noraman
keyword: PBEPBE/SDD
title: #p freq=noraman PBEPBE/SDD
converged: YES YES NO NO
title: Mulliken charges:
elementType: O O O O O N C C C C C C C C C C C C C C C C C H H H H H H H H H H H H H H H
charge: -0.270755 -0.249239 -0.261122 -0.239780 -0.256664 -0.014219 -0.100017 -0.288797 -0.127306 -0.351203 0.370551 0.332191 0.198350 -0.396186 -0.082056 -0.349433 -0.302959 0.329635 0.314425 -0.208891 -0.370808 -0.760828 -0.752676 0.249660 0.240995 0.274804 0.283733 0.249986 0.266909 0.284658 0.233866 0.243404 0.247264 0.263102 0.244327 0.249258 0.250220 0.255603
chargesum: 0.00000
title: Mulliken charges with hydrogens summed into heavy atoms:
elementType: O O O O O N C C C C C C C C C C C C C C C C C
charge: -0.270755 -0.249239 -0.261122 -0.239780 -0.256664 -0.014219 0.149643 -0.047802 0.147498 -0.067470 0.370551 0.332191 0.198350 -0.146200 -0.082056 -0.082524 -0.018301 0.329635 0.314425 0.024974 -0.127405 -0.006135 0.002405
polarizability: 2.45964800e+02 -5.93640933e+00 1.92831427e+02 3.44442943e+01 2.13869419e+01 1.77863141e+02
1716.lowfreq: -0.0004 0.0002 0.0004 3.8823 7.1333 13.5042 21.9482 40.2169 45.4851
frequency: 21.8745 40.2157 45.4792 49.7817 60.6995 71.3108 79.6686 81.7653 101.2175 116.5722 169.7632 176.5897 194.6031 205.7448 233.1084 259.0958 282.8501 289.8390 352.2601 376.1265 415.5342 419.8774 455.7269 475.2983 496.2879 532.6641 539.3781 552.1106 562.7324 565.3754 569.7894 603.2852 606.9848 657.5448 675.3810 689.0863 700.9213 725.8041 786.0961 799.5617 824.7281 830.8276 842.0201 852.5422 862.1342 879.1315 892.3566 907.0679 948.2014 953.1519 973.4196 987.1472 988.5197 996.8572 998.6682 1000.5063 1042.2630 1042.9049 1043.6082 1062.5165 1075.7039 1118.2367 1148.8211 1188.2567 1196.8372 1207.8935 1217.7131 1233.4952 1237.7341 1252.0679 1271.3432 1289.5670 1306.8953 1331.3621 1351.3492 1371.5778 1378.1063 1383.5823 1386.3377 1392.7514 1414.5002 1431.7851 1452.2583 1453.0929 1453.8696 1454.5566 1469.6247 1503.9110 1562.2437 1589.7713 1620.6839 1645.1778 1657.1197 3008.1590 3008.7319 3045.4450 3077.2844 3100.1038 3100.7364 3106.9829 3124.7765 3135.8100 3142.9006 3143.8031 3144.4121 3145.6731 3167.8328 3172.4366
redmass: 5.6684 1.1875 5.0906 4.3259 3.0925 3.3046 5.7741 1.3147 4.1681 4.7362 6.5280 5.4360 6.0294 7.7816 5.4273 4.1756 8.2069 7.3588 5.1851 3.7859 3.8884 5.2364 4.7309 4.0618 4.9866 5.3928 4.5090 3.5941 3.5260 3.7001 5.8295 5.7954 5.3242 6.7669 5.6315 5.4705 4.9630 3.7710 3.0348 2.2477 3.8600 3.3695 4.6615 3.8556 2.1649 4.3368 4.5161 6.5178 1.4387 5.2235 3.6586 1.3585 1.9597 1.9848 1.8306 1.4440 1.7333 2.2086 1.6602 2.0490 1.3847 1.6672 1.3497 3.2682 2.7512 1.9478 2.1624 1.7211 1.3186 2.1709 1.2583 2.0583 1.3878 1.8349 2.0859 2.8290 2.2936 1.2441 1.2494 1.7075 2.9519 3.1471 1.0584 1.0578 1.0528 1.0531 3.3571 3.8324 7.3345 5.8423 6.9295 9.5576 9.9667 1.0377 1.0378 1.0849 1.0842 1.0955 1.0952 1.0888 1.0896 1.0893 1.1017 1.0935 1.1018 1.0904 1.0994 1.0963
irintensity: 0.0259 1.0923 1.6927 0.0920 2.1861 3.9100 1.8399 0.8226 3.6389 0.8187 7.3326 1.4537 5.4327 6.9773 1.6463 2.0442 2.1626 8.8778 0.3850 2.9394 3.8140 16.2805 16.1256 11.4864 14.3891 1.7995 2.4654 4.0192 4.5042 6.9132 5.1742 2.1045 6.5687 10.4656 12.3016 10.2897 18.6729 6.9884 10.7090 11.5711 10.6233 38.4932 5.9254 28.0788 17.1175 6.7496 41.0794 165.7716 0.9931 7.4937 52.2641 0.1033 43.4772 63.6422 69.0255 6.8195 7.7844 3.2928 7.3520 6.0479 2.1849 7.0886 2.1415 488.0288 205.7885 15.4077 14.4522 2.9568 2.9507 8.6489 17.5798 6.5067 1.1676 10.9006 6.1679 3.4619 4.3670 66.8061 40.5305 5.2346 7.8406 10.0814 22.4505 21.2125 17.2338 21.3986 11.2710 25.3216 2.9904 4.6065 4.4293 173.3664 151.1010 1.1714 1.2175 13.8077 7.4115 6.5073 6.5599 14.1122 21.9351 7.1388 8.1790 19.7577 7.0134 5.9687 21.4328 7.2472
temp: 298.150 k
press: 1.00000 atm
elementType: 8 8 8 8 8 7 6 6 6 6 6 6 6 6 6 6 6 6 6 6 6 6 6 1 1 1 1 1 1 1 1 1 1 1 1 1 1 1
symmnumber: 1
zpe: 751493.4 jmol-1
zpe.correction: 0.286229 hartree
zpe.thermalcorrener: 0.306737 hartree
zpe.thermalcorrenthalpy: 0.307681 hartree
zpe.thermalcorrgfe: 0.234866 hartree
zpe.sumelectzpe: -1086.014058 hartree
zpe.sumelectthermal: -1085.993550 hartree
zpe.sumelectthermalent: -1085.992606 hartree
zpe.sumelectthermalfe: -1086.065420 hartree
dipole: 1.1133 2.0273 -0.9175
dipole: 2.4882
quadrupole: -145.6556 -128.6186 -118.7081
quadrupole: 4.5455 -1.1075 -6.6795
quadrupole: -14.6615 2.3754 12.2860 4.5455 -1.1075 -6.6795
hfenergy: -1086.3002863 hartree
pointgroup: C01 [X(C17H15N1O5)]
dipole: -0.1455261 0.884458 0.3935454 debye
polarizability: 246.3537774|-13.3094857|196.3759402|22.4231424|-30.091078|173.9296493 unknown
InChI: InChI=1S/C17H15NO5/c1-8(19)21-15-13-10-4-3-7-18-12(10)6-5-11(13)14-16(23-14)17(15)22-9(2)20/h3-7,14-17H,1-2H3
charge 0 multiplicity 1
38 atoms
O  1.897957 -2.399807 1.114214
O  2.097067 -0.938376 -1.252885
O  0.967304 1.832301 0.881418
O  4.340738 -1.404868 -0.846255
O  0.49728 3.365816 -0.822082
N  -4.179476 -0.378341 -0.231601
C  2.262327 -0.943926 1.243962
C  1.019918 -1.428991 1.917731
C  2.106451 -0.097901 -0.026653
C  0.779768 0.676616 -0.08141
C  -0.313007 -1.111913 1.329928
C  -0.444728 -0.106929 0.353213
C  -1.743927 0.186331 -0.197907
C  -1.456317 -1.845826 1.778657
C  -2.891751 -0.580612 0.253399
C  -2.718548 -1.59361 1.249065
C  -1.994321 1.211525 -1.174239
C  3.308268 -1.600819 -1.522645
C  0.788529 3.129512 0.372329
C  -3.291034 1.405173 -1.652212
C  -4.353007 0.583272 -1.157584
C  3.146206 -2.543231 -2.689453
C  0.971185 4.151839 1.470037
H  3.172642 -0.770675 1.825577
H  1.046939 -1.645002 2.993079
H  2.949995 0.612357 -0.08907
H  0.667205 1.099282 -1.092875
H  -1.322724 -2.621955 2.540713
H  -3.607025 -2.146046 1.568166
H  -1.18378 1.854791 -1.53062
H  -3.50576 2.179579 -2.394948
H  -5.376615 0.720305 -1.52682
H  2.50557 -2.100727 -3.468794
H  2.652605 -3.466318 -2.334832
H  4.132866 -2.80187 -3.100577
H  1.082422 5.153052 1.029345
H  1.846155 3.905392 2.092807
H  0.083326 4.145503 2.128023
