program: Gaussian 09
title: 000190579
version: EM64L-G09RevD.01
frameworkgroup: C1[X(C17H16BrNO5)]
method: RPBEPBE
basis: SDD
operation: Freq
keyword: #p
keyword: freq=noraman
keyword: PBEPBE/SDD
title: #p freq=noraman PBEPBE/SDD
converged: YES YES NO NO
title: Mulliken charges:
elementType: Br O O O O O N C C C C C C C C C C C C C C C C C H H H H H H H H H H H H H H H H
charge: 0.006998 -0.255333 -0.255158 -0.441249 -0.251439 -0.269591 -0.011682 -0.001022 -0.275116 -0.681507 -0.174208 0.242118 0.231014 0.234455 -0.364581 -0.087184 -0.330022 -0.292697 0.345452 0.343028 -0.209829 -0.370556 -0.768067 -0.769168 0.303440 0.289296 0.345115 0.254062 0.292813 0.266845 0.358588 0.282831 0.233157 0.243551 0.263346 0.255761 0.247635 0.275964 0.250321 0.242619
chargesum: 0.00000
title: Mulliken charges with hydrogens summed into heavy atoms:
elementType: Br O O O O O N C C C C C C C C C C C C C C C C C
charge: 0.006998 -0.255333 -0.255158 -0.082661 -0.251439 -0.269591 -0.011682 0.302418 0.014180 -0.336392 0.079853 0.242118 0.231014 0.234455 -0.071768 -0.087184 -0.063177 -0.009866 0.345452 0.343028 0.023327 -0.127005 -0.001325 -0.000264
polarizability: 2.98480971e+02 -1.18931078e+01 2.50405978e+02 1.48480861e+01 -1.41379463e+01 1.37984682e+02
1716.lowfreq: -9.3366 -4.1689 -0.0001 0.0006 0.0007 2.5517 19.5360 33.3872 40.3243
frequency: 19.4633 33.2751 40.3017 46.1961 55.9355 63.2307 73.0179 77.8505 87.7170 114.4853 115.3532 140.4533 173.3828 178.7870 187.6960 205.9589 216.7892 258.7904 274.8569 285.8279 297.2693 354.3518 366.5171 383.3196 399.8501 439.9840 450.8322 468.2885 484.8800 504.0603 525.6596 543.6497 550.5695 562.3736 574.2022 592.5363 612.2982 617.2206 632.2651 668.8944 685.6698 744.4546 775.9774 796.1953 815.1916 832.4993 846.8562 866.1822 885.3996 903.0267 910.4886 946.1311 947.3173 990.3341 995.4356 997.8502 1000.8136 1004.4327 1034.3847 1041.1856 1043.0503 1044.6756 1073.6645 1079.9698 1130.4343 1149.3769 1169.5225 1180.9069 1182.7197 1184.2441 1200.1312 1208.7086 1232.3069 1241.1259 1255.5418 1279.0211 1287.4039 1318.8382 1328.5613 1340.6838 1360.6716 1364.1753 1378.9647 1381.4563 1385.5872 1388.4883 1419.1527 1451.8826 1452.1031 1453.3793 1454.0110 1465.2864 1497.0978 1559.9138 1590.1149 1619.4279 1643.1912 1659.6887 2931.3118 3005.0536 3007.2451 3021.5719 3030.7848 3093.5569 3100.7211 3100.8653 3124.6537 3142.4071 3143.9805 3144.9231 3163.2995 3167.7702 3187.3318 3517.0319
redmass: 6.1958 1.5211 8.5146 8.4477 3.5013 2.2505 4.3930 5.4823 5.0898 1.6978 2.1042 5.1937 5.3532 11.1804 9.1188 8.3234 5.4433 5.0876 5.1536 4.9600 4.9480 4.3980 5.7019 1.1955 4.1386 3.8039 5.3654 4.3551 4.6672 4.4791 5.4998 3.4112 3.7075 3.3085 3.9105 5.2829 5.5606 6.1299 5.5597 4.8127 5.2599 3.3492 3.3577 2.4438 2.8052 4.4583 4.6316 1.7531 5.8630 6.4071 4.8680 2.1950 2.5478 2.0656 1.3618 1.9587 1.4610 3.6074 4.3305 2.5520 1.7329 1.6906 2.6549 4.6896 3.4264 1.3138 1.3024 1.9948 1.5147 1.5642 2.9460 1.5233 2.0197 1.3846 2.0402 1.3999 1.2770 1.3072 1.4849 1.8740 1.8065 1.8195 2.0319 1.3045 1.2979 2.5944 2.9168 1.0581 1.0552 1.0555 1.0558 3.3527 3.8327 7.5618 6.0367 7.3001 9.7204 9.8372 1.0819 1.0383 1.0383 1.0831 1.0839 1.0873 1.0941 1.0942 1.0895 1.1026 1.1022 1.0902 1.0890 1.0995 1.0967 1.0653
irintensity: 0.0451 3.7439 0.1051 1.7305 0.6019 6.3882 0.6072 0.8783 0.5016 0.0682 0.4584 1.2450 4.0830 2.8432 4.5253 1.2908 5.6783 7.3172 3.6894 9.0411 9.9782 13.8724 1.3543 137.6611 3.0216 4.8017 14.4495 28.7149 39.6253 7.3788 2.0904 5.7563 4.5930 3.9549 14.3871 8.4125 7.5636 8.0531 12.5532 7.3724 32.5407 7.4074 11.0863 22.6795 15.6429 20.5547 14.4488 47.4512 22.2369 139.0344 10.6424 23.7210 36.9063 13.8970 4.3572 90.4303 23.1575 29.1486 14.7274 5.0282 10.9920 5.7777 3.2549 35.1863 10.3103 14.5415 90.7502 45.4761 42.2330 2.8859 538.9077 51.1004 2.0363 9.0252 3.2379 20.8752 2.5898 0.7961 11.1889 8.3202 1.9815 29.5184 10.5461 64.0277 54.8807 5.3638 1.8854 30.2701 20.9738 9.7841 15.4680 0.0905 49.4385 7.0828 8.7593 2.2616 152.7050 164.1834 25.3309 0.6651 0.5363 12.5181 5.0642 2.3502 10.1467 0.8350 22.2655 7.0477 7.3571 4.4717 1.7557 21.4571 4.4160 13.6731
temp: 298.150 k
press: 1.00000 atm
elementType: 35 8 8 8 8 8 7 6 6 6 6 6 6 6 6 6 6 6 6 6 6 6 6 6 1 1 1 1 1 1 1 1 1 1 1 1 1 1 1 1
symmnumber: 1
zpe: 783770.6 jmol-1
zpe.correction: 0.298522 hartree
zpe.thermalcorrener: 0.321383 hartree
zpe.thermalcorrenthalpy: 0.322328 hartree
zpe.thermalcorrgfe: 0.243545 hartree
zpe.sumelectzpe: -1100.025467 hartree
zpe.sumelectthermal: -1100.002606 hartree
zpe.sumelectthermalent: -1100.001662 hartree
zpe.sumelectthermalfe: -1100.080445 hartree
dipole: 0.9085 1.7093 0.0196
dipole: 1.9359
quadrupole: -150.5330 -146.2448 -145.7125
quadrupole: -9.1807 -3.0628 -2.9281
quadrupole: -3.0363 1.2520 1.7843 -9.1807 -3.0628 -2.9281
hfenergy: -1100.3239894 hartree
pointgroup: C01 [X(C17H16Br1N1O5)]
dipole: -0.51158 0.3446377 0.4467479 debye
polarizability: 281.2211597|41.7852759|208.4981929|-10.124081|58.4573873|197.152278 unknown
InChI: InChI=1S/C17H16BrNO5/c1-8(20)23-16-13-10-4-3-7-19-12(10)6-5-11(13)15(22)14(18)17(16)24-9(2)21/h3-7,14-17,22H,1-2H3
charge 0 multiplicity 1
40 atoms
Br -3.15773 -3.120167 -1.137285
O  -2.279207 -1.164426 1.303261
O  -0.781939 1.411213 -0.118135
O  -0.357038 -3.160287 -2.770112
O  -3.741699 0.642976 1.05249
O  -0.822054 1.946776 2.157706
N  4.506406 0.433074 -0.926196
C  -1.672761 -0.86268 -0.017573
C  -0.391721 -0.010857 0.210161
C  -1.385352 -2.183969 -0.719848
C  -0.629054 -1.92782 -2.038705
C  0.814127 -0.372702 -0.633318
C  0.709985 -1.269688 -1.709334
C  2.09288 0.220871 -0.322927
C  1.852784 -1.592431 -2.507181
C  3.240485 -0.097831 -1.149276
C  3.088497 -1.009163 -2.242002
C  2.313848 1.113061 0.780163
C  -3.324242 -0.318053 1.732966
C  -1.055891 2.263518 0.968462
C  3.590629 1.632482 1.000325
C  4.656519 1.271247 0.116754
C  -3.799854 -0.735233 3.101025
C  -1.670536 3.549997 0.482961
H  -2.386066 -0.256826 -0.607975
H  -0.153483 -0.042544 1.290073
H  -0.850378 -2.907308 -0.084017
H  -1.248135 -1.244474 -2.663712
H  1.727508 -2.314155 -3.317215
H  3.975083 -1.23248 -2.84255
H  -1.223775 -3.614273 -2.942476
H  1.495394 1.385148 1.453685
H  3.785915 2.309734 1.837427
H  5.663922 1.676488 0.270874
H  -3.10069 -0.338397 3.859886
H  -3.813944 -1.832453 3.194721
H  -4.79928 -0.31733 3.290537
H  -2.756358 3.382181 0.356754
H  -1.255513 3.845709 -0.493106
H  -1.520781 4.34517 1.22821
