program: Gaussian 09
title: 000190562
version: EM64L-G09RevD.01
frameworkgroup: C1[X(C13H12BrNO)]
method: RPBEPBE
basis: SDD
operation: Freq
keyword: #p
keyword: freq=noraman
keyword: PBEPBE/SDD
title: #p freq=noraman PBEPBE/SDD
converged: YES YES NO NO
title: Mulliken charges:
elementType: Br O N C C C C C C C C C C C C C H H H H H H H H H H H H
charge: -0.040709 -0.432438 -0.015385 -0.270350 -0.547839 0.263707 -0.411736 -0.530371 0.298664 0.250337 -0.373644 -0.084993 -0.345559 -0.279251 -0.200767 -0.372524 0.254489 0.297934 0.245577 0.243329 0.257312 0.234033 0.237713 0.262452 0.252660 0.341127 0.225959 0.240272
chargesum: 0.00000
title: Mulliken charges with hydrogens summed into heavy atoms:
elementType: Br O N C C C C C C C C C C C C C
charge: -0.040709 -0.091311 -0.015385 -0.015861 -0.249905 0.263707 0.077171 -0.039026 0.298664 0.250337 -0.135931 -0.084993 -0.083107 -0.026591 0.025193 -0.132252
polarizability: 2.06982953e+02 2.15559944e+01 1.72881489e+02 1.24267118e+01 -4.00644142e+00 1.15849287e+02
1716.lowfreq: -10.7635 -1.8092 -0.0005 0.0003 0.0006 12.0404 41.0061 63.4858 110.6408
frequency: 40.9925 63.4555 110.6357 138.7513 168.1109 185.1805 218.8804 270.7147 284.3275 302.1953 308.1569 364.2040 391.4385 419.1624 461.6333 483.7076 499.2435 528.5254 547.8564 567.1911 626.5586 665.5607 674.9517 699.9627 751.8731 780.1234 825.6730 841.4511 846.2890 862.4562 889.7032 915.9766 934.6996 957.7557 978.2057 986.6988 990.2086 1016.3622 1041.7965 1062.0292 1120.3820 1140.8904 1154.1556 1159.8798 1181.3222 1195.3390 1210.0449 1233.6557 1236.6421 1249.0583 1291.3929 1320.4822 1322.5397 1353.6056 1357.3856 1369.9799 1386.8560 1395.8923 1423.3206 1442.6518 1452.6077 1473.5583 1497.0772 1562.7232 1590.0972 1623.0327 2977.8595 2984.0548 2987.1306 3033.8156 3065.5629 3073.4362 3122.5467 3124.1882 3148.1395 3168.3624 3170.8811 3521.9092
redmass: 9.9523 5.4322 5.3293 6.9239 4.0565 4.4298 4.6519 2.9330 2.8066 3.8854 1.1963 4.0852 5.4269 4.1929 3.9763 5.0697 3.4645 4.3916 5.1354 3.4930 4.5620 4.7609 4.0404 5.3562 2.1275 1.6636 2.5422 2.4629 3.9719 2.3108 3.0255 4.3721 1.5857 3.5067 1.3833 1.3891 2.6974 2.0117 2.3802 2.1379 1.4936 1.3298 1.1562 1.2759 1.3742 1.4192 1.2929 1.6765 2.0975 2.2899 1.6290 1.4297 1.4422 2.2129 1.9559 1.8491 2.6272 1.9182 3.1958 1.1008 1.1739 2.7210 3.8784 7.4219 6.0675 7.1470 1.0633 1.0645 1.0841 1.0968 1.0918 1.0937 1.0892 1.0891 1.0894 1.0960 1.0987 1.0662
irintensity: 0.2717 0.4795 0.6846 5.4877 5.1775 4.9793 0.7263 6.9680 23.8780 8.9224 92.7997 6.3936 4.7358 2.3347 7.4005 1.0965 3.1521 7.1457 6.7653 7.2779 17.5886 1.7725 28.4199 10.5323 8.3096 14.3777 26.0752 19.5324 2.9263 45.2497 37.1811 39.0651 2.3066 0.3444 0.5660 1.6121 5.0753 7.3378 0.4654 16.4840 0.4977 8.6711 2.9238 62.3443 6.1962 1.2710 27.1155 3.1221 4.4155 7.8963 1.5741 6.4364 18.0409 12.7264 0.0952 2.3252 6.7092 4.7301 3.5983 13.3681 16.3218 0.6304 46.2005 6.9146 5.8721 4.0833 14.0775 9.8632 22.5308 19.1793 12.2329 32.4490 19.4525 12.3162 18.2756 12.8312 21.3469 13.1251
temp: 298.150 k
press: 1.00000 atm
elementType: 35 8 7 6 6 6 6 6 6 6 6 6 6 6 6 6 1 1 1 1 1 1 1 1 1 1 1 1
symmnumber: 1
zpe: 573161.7 jmol-1
zpe.correction: 0.218306 hartree
zpe.thermalcorrener: 0.231529 hartree
zpe.thermalcorrenthalpy: 0.232474 hartree
zpe.thermalcorrgfe: 0.177688 hartree
zpe.sumelectzpe: -644.889297 hartree
zpe.sumelectthermal: -644.876073 hartree
zpe.sumelectthermalent: -644.875129 hartree
zpe.sumelectthermalfe: -644.929915 hartree
dipole: 1.9955 -1.6058 2.0366
dipole: 3.2724
quadrupole: -109.3295 -86.9114 -107.1511
quadrupole: 7.8821 6.9926 -2.6630
quadrupole: -8.1989 14.2193 -6.0204 7.8821 6.9926 -2.6630
hfenergy: -645.1076028 hartree
pointgroup: C01 [X(C13H12Br1N1O1)]
dipole: 0.8488681 -0.8021434 0.5418077 debye
polarizability: 212.2866857|16.8277278|169.927325|-3.9800604|-0.2600334|113.4997176 unknown
InChI: InChI=1S/C13H12BrNO/c14-10-5-3-8-4-6-11-9(2-1-7-15-11)12(8)13(10)16/h1-2,4,6-7,10,13,16H,3,5H2
charge 0 multiplicity 1
28 atoms
Br 3.209313 -0.739174 -2.113326
O  1.259122 -1.858428 1.503765
N  -3.260323 0.706019 -0.184335
C  1.375767 -1.26725 0.135814
C  2.861665 -0.924374 -0.087915
C  0.445796 -0.066148 0.094476
C  3.279462 0.345132 0.650939
C  2.43182 1.55465 0.221141
C  0.943888 1.247277 0.134966
C  -0.978087 -0.291883 0.004094
C  0.032305 2.354028 0.061431
C  -1.880368 0.838774 -0.079483
C  -1.340578 2.164281 -0.048843
C  -1.577936 -1.594998 -0.002607
C  -2.964188 -1.721607 -0.110441
C  -3.76757 -0.541516 -0.202934
H  1.064613 -2.019125 -0.617242
H  3.499346 -1.786997 0.166078
H  4.355077 0.545707 0.507497
H  3.111202 0.134308 1.727459
H  2.777661 1.908251 -0.771132
H  2.595822 2.393329 0.92385
H  0.441823 3.371027 0.091817
H  -2.04245 3.001289 -0.109682
H  -0.953728 -2.487024 0.100281
H  1.637811 -2.776992 1.488166
H  -3.444191 -2.705317 -0.116089
H  -4.858173 -0.619839 -0.289444
