program: Gaussian 09
title: 000190560
version: EM64L-G09RevD.01
frameworkgroup: C1[X(C13H11N)]
method: RPBEPBE
basis: SDD
operation: Freq
keyword: #pfreq=noraman
keyword: PBEPBE/SDD
title: #p freq=noraman PBEPBE/SDD
converged: YES YES NO NO
title: Mulliken charges:
elementType: N C C C C C C C C C C C C C H H H H H H H H H H H
charge: -0.016512 0.365537 -0.577541 0.177121 -0.463871 0.247991 -0.334560 -0.430327 -0.212013 -0.087133 -0.338723 -0.296863 -0.193422 -0.374901 0.230583 0.225844 0.226571 0.217219 0.215869 0.237996 0.222547 0.260680 0.232643 0.226389 0.238877
chargesum: 0.00000
title: Mulliken charges with hydrogens summed into heavy atoms:
elementType: N C C C C C C C C C C C C C
charge: -0.016512 0.365537 -0.121114 0.177121 -0.020080 0.247991 -0.118691 -0.192331 0.010534 -0.087133 -0.078043 -0.064221 0.032967 -0.136024
polarizability: 2.27083489e+02 3.66148948e+00 1.56421841e+02 -4.62124955e-02 1.23930961e+00 6.65782688e+01
1716.lowfreq: -11.7252 -6.5078 -0.0002 -0.0002 0.0005 6.4047 90.8585 95.9789 169.1576
frequency: 90.8571 95.9769 169.1548 205.9005 236.3577 299.9501 372.3558 392.8028 433.0661 443.0909 477.3094 496.6138 538.1020 547.7734 572.1821 655.0517 659.8519 693.9099 731.3852 757.1214 784.4896 832.4478 845.4108 852.1495 865.5717 894.8667 934.2366 959.4588 972.1091 975.8951 983.2634 1012.9142 1029.9156 1044.0940 1077.0607 1140.9885 1158.3942 1164.5284 1196.0101 1210.3969 1232.2421 1245.7005 1260.4056 1321.5967 1325.8792 1350.9825 1369.7127 1380.0771 1400.5800 1418.0318 1446.6611 1456.8206 1462.3588 1499.2379 1558.3907 1579.0923 1603.9006 1638.5275 2944.4234 2952.8200 3036.7616 3040.1278 3118.5556 3120.2611 3124.0252 3142.3992 3150.4254 3167.9885 3169.3246
redmass: 3.3241 3.7844 2.7157 3.4042 4.4718 2.7009 2.9910 4.8136 4.3369 3.5277 4.2900 4.0846 4.1347 3.9475 3.5032 4.8579 2.2187 4.8728 2.3219 1.9342 1.5084 2.0014 3.1025 2.3723 3.9405 2.7298 1.4180 1.4269 3.2150 1.3561 1.3784 2.2746 2.1952 2.5065 2.1023 1.2861 1.1572 1.1557 1.5609 1.4770 2.0777 2.2365 1.4326 1.7507 1.7327 2.7722 2.1926 2.7177 1.9213 2.9740 1.3338 1.1069 1.9882 3.9120 7.4142 6.0193 6.9175 6.6625 1.0702 1.0640 1.0904 1.0954 1.0851 1.0891 1.0893 1.0916 1.0957 1.0989 1.0955
irintensity: 0.7105 0.5196 0.8111 6.8048 1.5016 2.0804 3.1203 0.3332 5.3410 5.1251 3.4691 0.9804 1.6996 0.5578 1.8262 0.6965 14.6799 1.5490 21.7849 7.9336 48.8594 30.9250 4.8401 28.2495 2.9175 11.1477 0.8755 0.5669 1.2418 0.1424 1.2625 5.1976 5.3954 4.4794 2.9253 0.6975 3.1815 3.1748 7.8018 3.6643 0.3081 1.6444 14.9541 1.6580 12.9314 5.6367 0.3020 11.3148 3.5434 1.8419 5.8947 14.0826 5.8619 29.1463 8.6759 10.7761 1.6736 1.0570 27.8861 40.1262 48.4843 24.9139 1.4360 25.8040 14.7550 9.5209 30.6847 40.7823 3.1825
temp: 298.150 k
press: 1.00000 atm
elementType: 7 6 6 6 6 6 6 6 6 6 6 6 6 6 1 1 1 1 1 1 1 1 1 1 1
symmnumber: 1
zpe: 528272.9 jmol-1
zpe.correction: 0.201209 hartree
zpe.thermalcorrener: 0.211397 hartree
zpe.thermalcorrenthalpy: 0.212341 hartree
zpe.thermalcorrgfe: 0.165557 hartree
zpe.sumelectzpe: -555.771525 hartree
zpe.sumelectthermal: -555.761337 hartree
zpe.sumelectthermalent: -555.760393 hartree
zpe.sumelectthermalfe: -555.807177 hartree
dipole: 2.5184 -1.7648 -0.0280
dipole: 3.0753
quadrupole: -74.1679 -73.9726 -86.0313
quadrupole: 7.9571 0.5061 0.2671
quadrupole: 3.8894 4.0846 -7.9740 7.9571 0.5061 0.2671
hfenergy: -555.9727338 hartree
pointgroup: C01 [X(C13H11N1)]
dipole: 0.9955798 -0.6873477 -0.0172148 debye
dipolederiv: -0.3157983 0.0181026 -0.0039976 -0.04508 -0.3259075 -0.0010369 -0.0022253 -0.0031201 -0.2428373 0.2709561 0.0271838 -0.0657924 0.0810167 -0.1644941 0.0178904 -0.1425807 -0.0291265 -0.0281273 -0.0680358 0.0424424 0.0027975 0.0290457 0.1070326 0.031411 0.0579544 0.0528013 0.1372934 0.0524405 -0.1479409 0.0033327 -0.2463899 0.0367715 -0.0084477 0.0132757 -0.0114567 -0.0045453 0.0947521 -0.0394597 -0.0442863 -0.0431625 -0.0758736 -0.0137929 -0.0987509 0.0140482 0.152085 0.0651768 0.168955 -0.0023597 -0.0981764 -0.2232317 -0.0012616 0.0214045 -0.0277304 0.048521 -0.1348387 0.0358261 0.0202802 -0.1211657 0.1346966 0.0433814 -0.0881974 0.0963765 -0.1862346 -0.1366884 0.0171924 0.0027081 0.0403931 0.1943512 -0.0032464 0.0317843 -0.0024863 -0.1581188 0.026164 0.0343853 0.0719422 0.2174696 0.0459471 0.1012828 0.1954354 0.0341843 -0.1730612 0.1396056 -0.0387889 0.0044685 0.4142918 0.0567093 -0.0047739 0.0082306 0.0013732 0.0497784 -0.1203395 -0.0150392 -0.0139382 -0.049786 0.0576316 0.018529 0.00598 0.0179154 -0.150528 0.1445583 -0.0410064 -0.0090083 0.0717061 0.1337717 0.001573 -0.0122127 0.0078498 -0.1304375 -0.3179955 0.0818701 0.0059163 0.1787076 0.0405694 -0.0052277 0.012676 -0.0017758 -0.1233553 0.383745 -0.0370761 -0.0156546 -0.2213459 0.1591611 0.0171662 -0.0258518 0.0119727 -0.0735678 -0.034582 -0.0294103 0.0395342 0.0461315 0.0879839 -0.0109036 0.0731958 0.0426937 -0.1320449 0.0258194 -0.0340488 -0.0218129 -0.1075726 -0.1157326 -0.0559852 -0.0637946 -0.0779021 0.0651266 0.1026673 0.0052063 0.012092 -0.1064619 0.0599268 -0.0365664 -0.0823916 -0.0056644 -0.1564878 -0.2028126 0.0127425 0.0373461 0.014492 0.0728641 -0.0050635 0.0933665 -0.002606 0.0815713 0.0349708 -0.1099219 -0.0389763 -0.0271165 -0.0719256 -0.0472592 -0.0165545 -0.0492957 0.1408215 0.0215832 -0.1218512 -0.0002141 -0.0716453 -0.0682449 -0.0029359 -0.0056413 -0.0048052 0.1439094 -0.0022592 0.0864783 -0.0125596 0.0801594 -0.0994213 -0.018604 0.0046494 -0.0380093 0.1573175 0.0526411 0.0898325 0.007728 0.0388885 -0.0148441 -0.0096954 0.0002373 -0.0132949 0.155686 0.0733121 0.1075361 0.0076964 0.0547364 -0.0494022 -0.0032132 0.003004 -0.0077514 0.1352429 0.0134513 -0.0947262 0.002794 -0.1210357 -0.0601894 -0.0022458 0.005049 -0.0030582 0.1630266 -0.1684936 -0.0184834 0.0099637 -0.0081 0.0818499 -0.0009746 0.0119581 -0.0011321 0.1289663 unknown
polarizability: 227.0296956|4.1480221|156.4453897|-0.0027349|2.0626961|66.608514 unknown
InChI: InChI=1S/C13H11N/c1-2-5-11-10(4-1)7-8-13-12(11)6-3-9-14-13/h2-3,5-9H,1,4H2
charge 0 multiplicity 1
25 atoms
N  -2.853165 0.898781 0.093585
C  1.389759 0.885894 -0.087725
C  2.906446 0.921394 -0.238121
C  0.724344 -0.363104 -0.112243
C  3.595811 -0.296747 0.417845
C  -0.720157 -0.398933 -0.047034
C  1.537164 -1.591641 -0.204308
C  0.641122 2.09754 -0.000522
C  2.881158 -1.581848 0.038957
C  -1.4632 0.84686 0.033459
C  -0.754429 2.087773 0.057782
C  -1.492565 -1.608312 -0.0488
C  -2.886212 -1.546713 0.011487
C  -3.524674 -0.267449 0.078575
H  3.147145 0.920536 -1.323499
H  3.311405 1.8638 0.173938
H  3.586878 -0.19228 1.525022
H  4.659134 -0.337936 0.117639
H  1.044812 -2.539482 -0.44816
H  1.181338 3.051836 0.015283
H  3.4557 -2.515718 0.005019
H  -1.342476 3.007831 0.123885
H  -0.994886 -2.581864 -0.089147
H  -3.493694 -2.457325 0.011124
H  -4.618457 -0.19739 0.12486
