program: Gaussian 09
title: 000190592
version: EM64L-G09RevD.01
frameworkgroup: C1[X(C20H30O6)]
method: RPBEPBE
basis: SDD
operation: Freq
keyword: #pfreq=noraman
keyword: PBEPBE/SDD
title: #p freq=noraman PBEPBE/SDD
converged: NO YES NO NO
title: Mulliken charges:
elementType: O O O O O O C C C C C C C C C C C C C C C C C C C C H H H H H H H H H H H H H H H H H H H H H H H H H H H H H H
charge: -0.257150 -0.418776 -0.458325 -0.449267 -0.339379 -0.229218 0.132263 0.306278 -0.195833 -0.197557 -0.421728 0.545198 -0.126474 -0.608432 -0.499514 -0.793580 -0.188985 -0.449904 0.489907 -0.795331 -0.815828 0.296289 -0.533761 -0.054182 -0.705801 -0.690455 0.247024 0.239388 0.273864 0.250244 0.267625 0.253055 0.236271 0.220125 0.209613 0.283642 0.197165 0.266700 0.231338 0.234409 0.232482 0.329032 0.373781 0.384605 0.230093 0.238776 0.236969 0.232818 0.244662 0.216747 0.235112 0.218775 0.212745 0.209393 0.210835 0.242258
chargesum: 0.00000
title: Mulliken charges with hydrogens summed into heavy atoms:
elementType: O O O O O O C C C C C C C C C C C C C C C C C C C C
charge: -0.257150 -0.089745 -0.084544 -0.064662 -0.339379 -0.229218 0.132263 0.306278 0.051191 0.041831 -0.147864 0.545198 0.123770 -0.087751 -0.043119 -0.103159 0.077716 -0.218566 0.489907 -0.328440 -0.109990 0.296289 -0.056281 0.162565 -0.039169 -0.027970
polarizability: 2.82797290e+02 -4.23666275e+00 2.17129822e+02 5.56692236e-01 -9.23198680e+00 1.97948173e+02
1716.lowfreq: -8.5537 -6.6398 0.0008 0.0009 0.0011 13.3425 24.7568 26.6925 38.4852
frequency: 24.7027 26.5915 38.4616 41.1432 73.7888 82.3634 90.4477 99.6195 120.3373 129.8567 141.7081 151.3281 153.9345 174.4552 199.6198 212.4755 223.6038 240.4071 241.9234 249.7929 264.3492 273.1778 286.4017 288.5948 293.5888 305.5611 315.5640 326.2711 335.1202 347.1200 356.9017 373.3446 378.4320 414.2874 415.4453 436.6976 451.6305 457.1444 485.6340 499.6271 528.9926 547.0624 557.3116 582.5929 600.6690 613.0907 643.0259 683.2318 712.4413 718.5588 725.2714 740.8963 762.8380 774.6280 780.7998 784.0611 805.8188 850.2869 862.4700 866.2767 875.4192 889.4710 898.2399 913.5508 922.7933 938.5701 943.3405 952.5331 958.3844 966.1569 968.0840 980.2787 992.6420 1001.3093 1012.7337 1029.2402 1037.5775 1048.1156 1048.9325 1053.7838 1067.7431 1103.9687 1112.7338 1127.7427 1130.3599 1150.5128 1154.4557 1176.1413 1184.7927 1186.9554 1199.5326 1205.5418 1210.2354 1234.8954 1239.5211 1247.4936 1251.6483 1264.3028 1280.4112 1295.4492 1303.8509 1308.8878 1316.6423 1323.1935 1327.3382 1341.4526 1348.0541 1349.3763 1359.2942 1369.9915 1381.5639 1383.9566 1385.8847 1399.2733 1402.3899 1409.0318 1414.1595 1430.0982 1448.6852 1455.8526 1457.7063 1466.8562 1468.0499 1469.8711 1471.0187 1473.4221 1485.9974 1487.4463 1491.5015 1644.1386 1681.4994 1690.6300 2941.4988 2965.8906 2972.3635 2975.3959 2975.9290 2981.7044 3002.3286 3004.2027 3007.2877 3012.6982 3021.0426 3051.3168 3066.0720 3069.0256 3073.1077 3074.3053 3077.8646 3080.9843 3082.2262 3083.0336 3084.6693 3086.1656 3090.1080 3091.4898 3117.6233 3118.4544 3191.8429 3417.5625 3464.2019 3537.2150
redmass: 4.2311 3.5039 6.2542 3.7233 5.0239 3.8690 3.3722 3.4618 3.2535 4.6775 2.7320 2.8868 1.7470 3.6780 1.2702 2.0942 1.4321 4.2727 3.4492 3.4626 1.1283 4.0686 3.1234 2.5837 3.4299 3.6520 2.2263 2.9464 4.4400 1.8136 2.1091 2.5738 2.4951 3.3213 2.8848 2.5598 3.2210 3.3699 1.6359 3.0198 3.8018 3.3629 3.9073 4.2221 3.4198 4.3999 3.0101 1.2403 1.6226 3.3254 4.1997 3.2688 4.0813 3.4504 2.8918 3.3233 3.4168 2.6829 3.4587 2.3867 2.6016 2.1979 1.6824 2.2064 1.3320 2.3276 2.0449 1.4382 2.0254 2.9032 1.5792 2.1118 4.1973 5.1227 3.3483 3.5207 2.2522 2.6665 1.7278 1.7856 2.2165 1.5018 2.0307 1.8270 2.0107 2.4744 2.5651 2.0831 2.0139 2.0169 1.6526 1.9403 1.4376 1.4238 1.2834 1.3055 1.4613 1.4415 1.2175 3.2980 1.4321 1.2638 1.2807 1.3950 1.5301 1.2946 1.2897 1.3652 1.5712 1.3708 1.4252 1.2174 1.2709 1.2436 1.2122 1.1880 1.1658 1.1600 1.0817 1.0961 1.0523 1.0627 1.0623 1.0678 1.0457 1.0564 1.0532 1.0555 1.0481 9.8950 6.4425 7.1741 1.0830 1.0676 1.0427 1.0371 1.0724 1.0391 1.0398 1.0842 1.0724 1.0606 1.0711 1.0963 1.0991 1.0952 1.1002 1.1000 1.0993 1.0882 1.1023 1.0957 1.0901 1.0996 1.0995 1.0618 1.0980 1.0912 1.1136 1.0654 1.0655 1.0660
irintensity: 0.3603 1.0192 1.5069 0.7567 1.7940 2.6398 0.0707 0.8045 0.3703 0.5161 9.6746 0.9973 1.6802 1.4597 1.5830 2.1314 3.0226 35.9603 3.8767 3.8441 0.2841 5.9650 2.1866 1.3476 0.6120 0.4666 48.8641 31.4670 34.4469 14.3195 3.7264 9.8585 24.6616 3.5793 3.2334 3.1965 15.3617 15.4667 95.5009 3.9448 2.3136 19.0900 4.5276 4.6994 4.4588 3.8654 11.7584 75.6327 3.2372 2.5365 14.5149 15.1795 4.4517 11.0751 18.2783 1.6844 9.5890 73.5746 44.6639 44.8347 13.5240 8.5015 16.6412 92.6854 25.2080 68.1635 77.1849 46.2211 17.8403 75.4256 0.1945 20.1098 79.1359 77.9185 99.4605 2.5322 114.4967 0.1199 20.6533 12.1455 32.6752 5.4725 1.1449 20.9727 1.8289 7.4046 189.0731 14.0796 5.5634 28.1870 10.9028 22.3284 20.1664 27.6956 20.4048 7.8041 7.2924 59.5039 7.0059 0.2907 7.9917 4.4855 1.3365 14.9063 1.1500 10.5923 42.0807 12.1316 4.9194 7.1678 5.0106 8.5039 28.0191 18.1609 16.1314 5.5300 60.9531 22.2393 1.6744 7.9693 18.8816 18.5059 12.7667 12.3941 5.8143 0.5104 13.4340 14.6777 17.8145 182.4364 13.3156 11.4752 12.7218 44.9875 17.2671 23.4412 27.5649 30.0692 11.0828 31.0127 10.9098 16.0071 6.9210 15.5695 34.8271 29.7548 12.7183 11.2050 50.1354 17.1663 29.8685 38.5293 12.9980 45.2862 20.0029 6.8476 8.5706 20.9349 11.5606 210.9552 18.0985 6.2093
temp: 298.150 k
press: 1.00000 atm
elementType: 8 8 8 8 8 8 6 6 6 6 6 6 6 6 6 6 6 6 6 6 6 6 6 6 6 6 1 1 1 1 1 1 1 1 1 1 1 1 1 1 1 1 1 1 1 1 1 1 1 1 1 1 1 1 1 1
symmnumber: 1
zpe: 1231448.4 jmol-1
zpe.correction: 0.469034 hartree
zpe.thermalcorrener: 0.496218 hartree
zpe.thermalcorrenthalpy: 0.497162 hartree
zpe.thermalcorrgfe: 0.412798 hartree
zpe.sumelectzpe: -1229.382158 hartree
zpe.sumelectthermal: -1229.354974 hartree
zpe.sumelectthermalent: -1229.354029 hartree
zpe.sumelectthermalfe: -1229.438394 hartree
dipole: -2.4092 0.7112 2.0460
dipole: 3.2398
quadrupole: -160.9868 -156.8534 -160.9097
quadrupole: 2.8878 22.1773 -12.5579
quadrupole: -1.4035 2.7299 -1.3264 2.8878 22.1773 -12.5579
hfenergy: -1229.8511917 hartree
pointgroup: C01 [X(C20H30O6)]
dipole: 0.9193068 -0.350038 0.8105618 debye
polarizability: 281.7977545|-9.1282892|218.1164523|0.6520886|9.1997879|197.9610777 unknown
InChI: InChI=1S/C20H30O6/c1-10(2)6-15(22)25-13-8-20(9-21)14(7-11(13)3)26-17-12(4)19(20,5)18(24)16(17)23/h7,10,13-14,16-18,21,23-24H,4,6,8-9H2,1-3,5H3
charge 0 multiplicity 1
56 atoms
O  -2.681591 -1.484234 0.596515
O  -3.806044 2.628934 -1.012184
O  -4.65931 -0.758065 -1.156519
O  0.950078 1.382934 -1.528199
O  2.256093 -0.72488 -0.333587
O  3.85956 -1.537706 1.160583
C  -1.951908 1.316224 0.166119
C  -0.912123 0.174726 -0.274209
C  -3.203403 1.30671 -0.827249
C  -1.677082 -1.1663 -0.490844
C  -3.502877 -0.311937 1.021363
C  -2.623432 0.834875 1.4572
C  -4.228738 0.278994 -0.221954
C  0.155687 -0.049535 0.829574
C  -0.240895 0.545272 -1.648482
C  -1.271068 2.691745 0.272531
C  1.121339 -1.216984 0.569274
C  -0.785704 -2.383475 -0.545826
C  0.496307 -2.429096 -0.093131
C  -2.556966 1.356775 2.704493
C  1.355387 -3.670866 -0.191628
C  3.586386 -0.942718 0.095309
C  4.573835 -0.353175 -0.893708
C  5.255363 0.961203 -0.37829
C  4.217614 2.063993 -0.063198
C  6.189381 0.698302 0.825286
H  -2.937275 1.008573 -1.852601
H  -2.248719 -1.091593 -1.441711
H  -4.172154 -0.720892 1.793564
H  -5.134864 0.833078 0.089847
H  -0.369037 -0.277671 1.775002
H  0.743442 0.869257 0.996086
H  -0.939207 1.12816 -2.271022
H  0.007766 -0.389067 -2.194239
H  -0.463959 2.680761 1.025914
H  -0.822737 2.99551 -0.685411
H  -1.995131 3.468974 0.573013
H  1.621741 -1.516689 1.510473
H  -1.240456 -3.292076 -0.961273
H  -1.932153 2.227164 2.9346
H  -3.128517 0.925482 3.535123
H  -4.079423 2.988833 -0.129211
H  -4.285125 -1.620819 -0.826648
H  1.674843 0.793751 -1.176582
H  0.795062 -4.517812 -0.622223
H  1.737159 -3.96992 0.802895
H  2.243275 -3.490064 -0.827243
H  5.36028 -1.110282 -1.070115
H  4.057106 -0.153116 -1.847825
H  5.878832 1.311457 -1.226718
H  3.551386 2.266871 -0.921962
H  4.730021 3.008393 0.195206
H  3.586559 1.784059 0.8021
H  6.691688 1.634409 1.131059
H  6.970175 -0.043132 0.574103
H  5.626837 0.308583 1.691962
