program: Gaussian 09
title: 000190550
version: EM64L-G09RevD.01
frameworkgroup: C1[X(C4H10N2)]
method: RPBEPBE
basis: SDD
operation: Freq
keyword: #pfreq=noraman
keyword: PBEPBE/SDD
title: #p freq=noraman PBEPBE/SDD
converged: YES YES NO NO
title: Mulliken charges:
elementType: N N C C C C H H H H H H H H H H
charge: -0.303228 -0.544953 -0.127009 -0.464491 -0.416496 -0.437882 0.222887 0.229759 0.220331 0.195126 0.228113 0.233126 0.216136 0.217448 0.267987 0.263146
chargesum: 0.00000
title: Mulliken charges with hydrogens summed into heavy atoms:
elementType: N N C C C C
charge: -0.070102 -0.013820 0.095878 -0.014401 0.006743 -0.004298
polarizability: 6.42973332e+01 -9.22838107e-01 5.41541188e+01 -3.07119138e+00 -2.25497838e+00 4.81597767e+01
1716.lowfreq: -13.5372 -0.0008 -0.0005 0.0006 18.3231 26.4013 99.6640 138.1001 216.3904
frequency: 99.2371 138.0490 216.3839 258.3287 367.2375 444.5063 581.5774 595.7001 759.3274 784.7061 867.2311 897.3008 942.5757 962.7168 997.2105 1037.9638 1086.1881 1099.6544 1119.8035 1162.7899 1178.3672 1215.3845 1251.6681 1290.3124 1304.1660 1334.0501 1337.7111 1353.6058 1443.7050 1463.7543 1491.9316 1639.8204 2953.3105 2968.7830 2981.3082 3030.7215 3033.2101 3043.8877 3106.6522 3394.0486 3455.1458 3583.8710
redmass: 2.4812 1.8213 2.4951 1.1535 2.4147 1.8022 1.5826 1.9568 1.3704 1.9663 1.4943 1.9763 2.3421 1.9196 2.1960 2.1770 2.0884 3.3290 1.4914 1.6656 1.1726 1.3395 1.3388 1.3554 1.2930 1.2148 1.3190 1.3747 1.0885 1.0952 1.0971 1.0913 1.0655 1.0604 1.0868 1.0820 1.0836 1.0980 1.1070 1.0763 1.0445 1.0979
irintensity: 1.4949 5.3069 9.3801 57.2297 6.8787 50.0240 268.9610 123.7647 6.4221 22.0717 7.9180 4.6192 0.1202 7.6202 11.2049 0.6479 8.9571 12.1997 5.0883 1.8436 1.0624 0.2740 17.4036 17.2704 3.4492 0.5642 13.0405 9.9732 6.1331 7.6269 1.3302 38.0153 91.7466 45.5108 42.0880 34.1955 76.3919 47.4710 39.5582 7.4248 0.9349 0.3856
temp: 298.150 k
press: 1.00000 atm
elementType: 7 7 6 6 6 6 1 1 1 1 1 1 1 1 1 1
symmnumber: 1
zpe: 372480.7 jmol-1
zpe.correction: 0.141870 hartree
zpe.thermalcorrener: 0.148717 hartree
zpe.thermalcorrenthalpy: 0.149661 hartree
zpe.thermalcorrgfe: 0.111477 hartree
zpe.sumelectzpe: -267.368860 hartree
zpe.sumelectthermal: -267.362013 hartree
zpe.sumelectthermalent: -267.361069 hartree
zpe.sumelectthermalfe: -267.399253 hartree
dipole: -0.2112 0.1430 0.4279
dipole: 0.4981
quadrupole: -41.7163 -36.5932 -38.6165
quadrupole: -3.4641 -5.0239 -3.0212
quadrupole: -2.7410 2.3821 0.3588 -3.4641 -5.0239 -3.0212
hfenergy: -267.5107304 hartree
pointgroup: C01 [X(C4H10N2)]
dipole: -0.0990819 -0.0392381 -0.1644728 debye
dipolederiv: -0.5191144 0.125748 -0.051196 0.141285 -0.4485883 -0.1814811 -0.0470588 -0.2153008 -0.4332598 -0.9351993 -0.1285082 0.2600352 -0.0851443 -0.3010938 -0.1035724 0.3578193 -0.0740473 -0.4430358 0.1461755 -0.1776811 0.048805 -0.2610544 0.3047113 -0.1163117 0.1303726 -0.1016505 0.2715969 -0.1469269 0.0287333 -0.0752712 0.0234747 -0.0017753 0.0432591 -0.0595213 0.0522423 0.1156953 0.5245914 -0.0122433 0.0568571 0.0724113 0.0524022 0.082754 0.0520712 0.0261334 0.2832949 0.4982007 0.1382183 -0.0194166 0.1827446 0.2790128 0.0344063 -0.0253053 0.0367707 0.2008436 -0.048668 0.0657828 -0.0993525 0.0637801 -0.0027115 0.0610323 -0.1119385 0.0896742 -0.1495643 -0.0073261 -0.0665602 0.0878604 -0.0575511 0.0100413 0.0631099 0.0996106 0.1056527 -0.0400332 0.093109 0.0176746 0.0265925 -0.0082287 -0.0527721 -0.0901849 -0.0192744 -0.1500643 -0.0550896 0.0072288 -0.0114893 -0.0230262 -0.0175174 0.0366022 0.0253353 -0.1061501 0.0545163 -0.254973 -0.2157778 0.064615 0.0296114 0.069062 0.0515617 -0.0175843 0.0882346 -0.0359894 0.0449874 0.084586 -0.1485044 0.0053291 -0.087212 0.0669219 0.101235 0.023288 0.2087052 0.1838785 -0.0160129 -0.0136422 -0.1064797 0.0078381 0.0557728 0.0683609 -0.0717546 0.027235 -0.1219794 -0.0204598 0.0614117 0.0241103 0.0410043 -0.1997447 -0.0273913 0.033782 -0.0020051 0.08182 0.3083097 -0.0530485 -0.0614031 -0.0807951 0.1674471 0.0409773 -0.197089 0.0404854 0.0486717 0.247284 0.1094936 -0.1030557 -0.0040972 -0.0177875 0.0160557 -0.1470863 -0.0623578 0.2671466 unknown
polarizability: 64.7332703|0.6561814|54.6092938|1.4868941|-1.5389148|47.2686647 unknown
InChI: InChI=1S/C4H10N2/c5-3-4-1-2-6-4/h4,6H,1-3,5H2
charge 0 multiplicity 1
16 atoms
N  -0.5803 0.888943 0.581805
N  2.428827 0.213828 -0.292989
C  0.109092 -0.45995 0.548532
C  -1.258658 -1.109812 0.135009
C  -1.7694 0.339191 -0.174296
C  1.228287 -0.614805 -0.512263
H  0.503471 -0.751137 1.542075
H  -1.790217 -1.589147 0.972053
H  -1.214004 -1.806393 -0.718962
H  -1.783091 0.564772 -1.261779
H  -2.741702 0.623931 0.263423
H  -0.069169 1.684436 0.166502
H  0.819092 -0.369988 -1.513028
H  1.538229 -1.678754 -0.545394
H  2.918924 0.02293 0.586745
H  2.294619 1.217754 -0.446832
