program: Gaussian 09
title: 000190544
version: EM64L-G09RevD.01
frameworkgroup: C1[X(C12H6Br2O)]
method: RPBEPBE
basis: SDD
operation: Freq
keyword: #p
keyword: freq=noraman
keyword: PBEPBE/SDD
title: #p freq=noraman PBEPBE/SDD
converged: NO YES NO YES
title: Mulliken charges:
elementType: Br Br O C C C C C C C C C C C C H H H H H H
charge: 0.058438 0.057340 -0.252054 0.334740 0.219527 0.181315 0.159290 -0.334182 -0.352281 -0.364001 -0.351907 -0.234246 -0.165065 -0.250802 -0.213302 0.255012 0.267473 0.259656 0.259014 0.231769 0.234267
chargesum: 0.00000
title: Mulliken charges with hydrogens summed into heavy atoms:
elementType: Br Br O C C C C C C C C C C C C
charge: 0.058438 0.057340 -0.252054 0.334740 0.219527 0.181315 0.159290 -0.334182 -0.097268 -0.096528 -0.092251 -0.234246 0.093949 -0.019033 0.020964
polarizability: 2.64787733e+02 -1.16297199e+01 1.81203946e+02 1.06989599e-02 4.54084634e-03 5.94689148e+01
1716.lowfreq: -7.4970 -4.9826 -3.8447 -0.0008 -0.0003 -0.0002 43.3782 91.1513 123.7776
frequency: 43.3628 91.1477 123.7776 129.6888 133.4165 216.3758 228.9001 276.5609 295.6502 347.3208 368.2321 433.2626 454.5281 508.7477 541.8958 564.1195 583.8631 589.8082 633.0744 669.6614 720.9102 755.0978 770.4788 773.7814 805.9575 825.8285 865.1395 866.8238 941.1236 948.6782 985.9099 992.7418 1018.4178 1095.4565 1103.4747 1133.1824 1163.5176 1177.5957 1208.7424 1233.5666 1289.4300 1358.2319 1390.1878 1403.9067 1417.4212 1444.7648 1472.3753 1554.7125 1593.2943 1597.1693 1636.0682 3140.8114 3158.6407 3169.5930 3177.9351 3185.4169 3189.7562
redmass: 11.6811 5.0282 9.4998 55.1752 5.2620 17.8501 6.2281 8.9653 5.0881 7.6243 7.3958 3.0805 7.1146 4.2573 5.5678 4.1785 8.5254 5.0244 7.3110 8.5481 4.9739 1.8180 6.6621 2.4235 1.4127 7.1097 1.3949 10.1763 1.3356 1.3832 1.3167 6.8819 2.1211 2.3817 1.7916 2.3211 1.2963 1.9638 2.2046 3.0448 1.5870 5.1366 2.6164 7.3954 3.4009 2.9401 3.3970 7.9411 7.0995 8.4554 8.5031 1.0865 1.0920 1.0890 1.0959 1.0976 1.0978
irintensity: 0.1586 0.0093 0.6681 0.0603 3.3412 0.5397 1.7157 0.0141 0.4787 2.7221 6.0491 3.8054 0.9879 2.7308 2.8435 0.4567 17.8448 7.3605 6.7180 13.7017 4.8807 70.4982 10.5357 20.6520 59.4848 29.2021 0.2999 25.9869 0.8208 3.0296 0.0039 24.7587 37.6266 1.7121 12.6055 25.0038 9.0772 22.8454 95.6683 11.2544 4.2003 24.5898 71.2760 42.8833 24.2759 45.4760 0.7751 6.7137 1.4743 5.8791 5.2249 2.9467 15.1805 0.1278 7.4016 11.8086 1.2230
temp: 298.150 k
press: 1.00000 atm
elementType: 35 35 8 6 6 6 6 6 6 6 6 6 6 6 6 1 1 1 1 1 1
symmnumber: 1
zpe: 369643.3 jmol-1
zpe.correction: 0.140790 hartree
zpe.thermalcorrener: 0.152685 hartree
zpe.thermalcorrenthalpy: 0.153629 hartree
zpe.thermalcorrgfe: 0.100665 hartree
zpe.sumelectzpe: -562.007140 hartree
zpe.sumelectthermal: -561.995245 hartree
zpe.sumelectthermalent: -561.994300 hartree
zpe.sumelectthermalfe: -562.047265 hartree
dipole: 2.0298 0.6460 0.0002
dipole: 2.1301
quadrupole: -92.7040 -93.7710 -109.4788
quadrupole: -5.4173 0.0007 0.0004
quadrupole: 5.9473 4.8803 -10.8276 -5.4173 0.0007 0.0004
hfenergy: -562.1479295 hartree
pointgroup: C01 [X(C12H6Br2O1)]
dipole: 0.7399867 -0.3934022 -0.0000599 debye
dipolederiv: 0.0013454 -0.0580755 -0.0000026 0.0881192 -0.559049 -0.0000386 0.0000054 -0.0000295 0.0087632 -0.5856211 0.1968243 0.0000316 0.272852 -0.0730389 -0.0000136 0.0000298 -0.0000098 -0.0009151 -1.266667 -0.0246623 0.0000534 -0.1155409 -0.5297713 -0.0000127 0.0000505 -0.0000169 -0.1486444 0.1599429 -0.0911035 -0.0000116 0.335281 -0.4095 -0.000044 0.0000059 -0.000022 0.0522439 0.0626443 0.1379072 0.0000022 -0.1120541 -0.1121357 0.0000013 -0.0000083 -0.0000133 -0.011285 0.760404 -0.1427346 -0.0000402 -0.6528295 0.2080556 0.0000389 -0.0000667 0.0000155 0.0834686 0.4714922 0.2488143 -0.0000082 0.6040276 0.371405 -0.0000156 0.000012 0.0000024 0.0764474 -0.0945498 0.0863606 0.0000027 0.0480947 0.9927625 0.0000677 -0.0000014 0.0000598 -0.0879449 0.0978919 -0.0780101 -0.0000156 0.102069 0.0533103 0.0000042 -0.0000059 0.0000147 -0.1229311 -0.0242804 0.0850776 -0.0000001 0.0878143 0.0152593 0.0000049 0. 0.0000038 -0.163936 -0.0838875 -0.1612434 -0.0000126 -0.1170441 -0.0084006 0.0000137 -0.0000106 0.0000162 -0.1705773 0.8953375 -0.3365478 -0.0000485 -0.7392711 -0.1679017 0.0000194 -0.0000616 0.0000047 -0.1028327 -0.3419681 0.0004447 0.0000089 0.1775274 0.058285 0.0000033 0.0000155 0.0000098 -0.1021653 -0.196786 0.131849 0.0000075 0.1885344 0.0376855 0.0000007 0.0000105 0.0000025 -0.1700092 0.0283528 0.0011184 -0.0000101 -0.1214055 0.0803174 0.0000179 -0.0000148 0.0000119 -0.156784 0.1057388 0.0708857 0.0000065 0.0344811 -0.0146042 -0.000011 0.0000048 -0.0000134 0.1570197 0.0801471 0.0203564 0.0000053 -0.002053 -0.0249775 -0.0000103 0.0000043 -0.0000114 0.1857408 0.0703874 0.0383273 0.0000077 0.0740302 -0.0219413 -0.0000138 0.000009 -0.0000122 0.1833463 -0.0124582 -0.0574817 0.0000039 -0.0445052 0.0580345 -0.0000039 0.0000038 -0.0000027 0.1628087 -0.0005371 -0.0815812 0.0000046 -0.1121568 -0.0479559 -0.000005 0.0000032 -0.0000063 0.1654527 -0.126929 0.0134747 0.0000152 0.0040292 0.0941612 -0.0000035 0.0000146 -0.0000038 0.1627335 unknown
polarizability: 266.2014798|-3.8839889|179.7901991|-0.0097098|0.0063881|59.4689148 unknown
InChI: InChI=1S/C12H6Br2O/c13-8-5-6-10-11(12(8)14)7-3-1-2-4-9(7)15-10/h1-6H
charge 0 multiplicity 1
21 atoms
Br -1.529837 2.764183 0.000242
Br -4.530847 1.040119 0.000242
O  0.827579 -1.934306 -0.000126
C  -0.370949 0.083228 0.000041
C  1.058749 0.40516 -0.000022
C  -0.453885 -1.344696 -0.000032
C  1.741529 -0.848816 -0.000119
C  -1.583381 0.81684 0.000134
C  1.834252 1.590928 -0.000003
C  -1.654116 -2.062046 -0.000015
C  3.133629 -0.987503 -0.0002
C  -2.811249 0.112347 0.000144
C  -2.845321 -1.30719 0.000071
C  3.241763 1.478765 -0.000082
C  3.884478 0.2107 -0.000181
H  1.356319 2.573329 0.000075
H  -1.669017 -3.154108 -0.000069
H  3.607412 -1.972561 -0.000273
H  -3.813045 -1.815379 0.000081
H  3.851419 2.388236 -0.000068
H  4.978319 0.157872 -0.000241
