program: Gaussian 09
title: 000190554
version: EM64L-G09RevD.01
frameworkgroup: C1[X(C12H19F2N5S)]
method: RPBEPBE
basis: SDD
operation: Freq
keyword: #p
keyword: freq=noraman
keyword: PBEPBE/SDD
title: #p freq=noraman PBEPBE/SDD
converged: YES YES NO NO
title: Mulliken charges:
elementType: S F F N N N N N C C C C C C C C C C C C H H H H H H H H H H H H H H H H H H H
charge: 0.270783 -0.179544 -0.179832 -0.347728 -0.120195 -0.109817 -0.343454 -0.049546 -0.063302 -0.446076 -0.509432 -0.425279 -0.449337 0.093791 -0.029686 0.062736 -0.281421 -0.710486 -0.671183 -0.100035 0.262493 0.245809 0.207549 0.219273 0.238359 0.226865 0.219241 0.227370 0.217982 0.325693 0.240253 0.328134 0.224737 0.207369 0.235023 0.246139 0.210257 0.206521 0.299980
chargesum: 0.00000
title: Mulliken charges with hydrogens summed into heavy atoms:
elementType: S F F N N N N N C C C C C C C C C C C C
charge: 0.270783 -0.179544 -0.179832 -0.022035 -0.120195 -0.109817 -0.015320 -0.049546 0.199191 0.007281 -0.051800 0.020826 -0.003986 0.093791 0.210568 0.062736 -0.281421 -0.043357 -0.008267 0.199945
polarizability: 2.38981093e+02 -9.74808898e+00 2.21661381e+02 2.26246327e+00 7.66738889e+00 1.24579868e+02
1716.lowfreq: -30.0682 -7.3524 -3.5777 0.0004 0.0010 0.0019 11.1562 20.5362 31.8975
frequency: -25.3225 20.5251 31.8592 35.8537 46.2971 60.5667 65.2597 68.9413 80.6971 121.9750 152.3951 169.7027 177.9894 193.5239 208.0598 211.8184 249.4618 273.5944 309.8615 315.5160 336.6858 355.5091 402.0256 414.2236 444.3041 476.6727 509.6280 528.5760 549.4552 577.7874 610.9288 640.3023 649.1136 664.5601 694.4732 707.9921 722.0460 791.2143 796.8295 799.6480 816.1069 859.9551 880.0653 885.8767 896.5000 911.2772 919.7716 934.5388 945.8289 951.4931 969.4337 974.1492 1020.4962 1030.3360 1060.6058 1080.6596 1088.1181 1138.2849 1146.5648 1155.3589 1180.0052 1183.5916 1202.8913 1211.7798 1219.3129 1224.3724 1243.7206 1258.8419 1287.4748 1293.3959 1294.2755 1304.4823 1312.1802 1319.8041 1336.5226 1342.3433 1368.7426 1376.5890 1386.9753 1396.3630 1461.0679 1462.8591 1467.6768 1471.3937 1474.4300 1476.5394 1482.6568 1487.2888 1494.7170 1509.2581 1530.8310 1587.5017 2978.5054 2982.5375 2995.1295 3000.2560 3007.8345 3017.4741 3024.2970 3048.8625 3053.7140 3067.7602 3072.1771 3076.7179 3079.9247 3082.4292 3089.4005 3093.9179 3096.6817 3547.9194 3555.2116
redmass: 3.3118 10.6122 4.9484 3.4279 4.4009 3.3496 4.4700 1.8494 5.1851 3.9605 5.2050 9.2946 6.8807 5.3920 1.4936 1.7165 1.1911 4.3347 14.9310 3.1807 2.9031 4.6242 3.3440 4.8519 3.1694 3.8951 6.7833 5.5834 1.1833 1.1668 3.5879 6.9503 5.2010 3.7370 3.1607 7.2899 4.7481 9.0217 1.8976 1.7946 3.2948 3.2067 3.3197 3.3691 2.3330 3.4691 1.2297 1.8467 1.4865 9.2092 4.9914 2.2891 1.6173 1.9722 2.9921 2.0812 2.0774 2.1385 2.0638 2.0914 2.0256 1.6713 1.6497 1.6708 2.8077 1.8090 1.2123 1.4549 1.2590 1.2799 1.1142 1.6071 1.4337 1.5516 1.5021 1.4369 1.8617 1.2118 2.2479 1.2343 1.0887 1.0663 1.0565 1.2580 1.2334 1.0945 1.3758 1.0635 1.1573 2.3497 10.3851 7.3869 1.0373 1.0362 1.0615 1.0647 1.0613 1.0658 1.0849 1.0998 1.0875 1.1030 1.0987 1.1010 1.0904 1.0990 1.1033 1.1000 1.0999 1.0769 1.0769
irintensity: 0.0185 0.3951 0.5387 0.1729 0.7293 0.1601 0.7746 0.7984 0.0806 0.6188 1.7441 1.6968 2.8676 0.5790 0.4678 1.1418 0.2380 6.7211 0.7658 0.4608 2.2657 3.4353 0.4560 1.7676 0.0874 7.3972 6.4319 20.8419 97.4553 57.5252 3.4505 19.2784 6.8160 6.8617 63.4453 11.4238 88.3223 24.9556 1.2849 0.6923 19.9546 8.5304 2.0252 1.5339 9.4219 16.6465 8.3338 6.7401 8.0609 187.6842 323.0067 75.6610 4.3373 22.4933 0.7599 6.1591 1.3198 12.9225 53.5800 19.7421 109.4538 24.3714 13.9676 48.3189 2.1347 9.6018 14.9019 8.4652 5.0251 7.1666 6.1431 65.0287 9.0150 9.2571 166.7360 21.8840 46.8260 22.8037 226.8585 40.8754 12.6769 10.3616 13.7988 134.5470 41.1619 8.8403 121.4287 4.2789 53.9401 10.4173 1520.7709 457.8704 24.4694 33.2379 17.1983 31.5722 46.0188 33.5999 1.9676 15.3557 17.0947 2.0450 9.1840 25.1718 10.9723 55.3349 95.3171 24.0040 42.2078 75.3822 47.0754
temp: 298.150 k
press: 1.00000 atm
elementType: 16 9 9 7 7 7 7 7 6 6 6 6 6 6 6 6 6 6 6 6 1 1 1 1 1 1 1 1 1 1 1 1 1 1 1 1 1 1 1
symmnumber: 1
zpe: 817360.0 jmol-1
zpe.correction: 0.311316 hartree
zpe.thermalcorrener: 0.331659 hartree
zpe.thermalcorrenthalpy: 0.332603 hartree
zpe.thermalcorrgfe: 0.259230 hartree
zpe.sumelectzpe: -1338.660993 hartree
zpe.sumelectthermal: -1338.640650 hartree
zpe.sumelectthermalent: -1338.639706 hartree
zpe.sumelectthermalfe: -1338.713079 hartree
dipole: 7.8798 1.0252 0.3156
dipole: 7.9525
quadrupole: -141.5044 -108.2382 -129.1947
quadrupole: -4.1220 -0.6200 2.2412
quadrupole: -15.1920 18.0742 -2.8823 -4.1220 -0.6200 2.2412
hfenergy: -1338.9723091 hartree
pointgroup: C01 [X(C12H19F2N5S1)]
dipole: -3.1228989 0.0371439 0.1878438 debye
polarizability: 235.8532168|-12.307399|222.6708677|-4.6021972|-15.4423394|126.6982582 unknown
InChI: InChI=1S/C12H19F2N5S/c1-7(2)15-10-17-11(16-8-5-3-4-6-8)19-12(18-10)20-9(13)14/h7-9,15-16H,3-6H2,1-2H3
charge 0 multiplicity 1
39 atoms
S  3.775426 0.798108 -0.246617
F  5.090104 -1.091894 1.203278
F  4.850581 -1.586137 -1.005023
N  -0.648351 -1.59109 0.664245
N  -0.774341 0.705342 0.155047
N  1.362987 -0.477863 0.23799
N  -0.722494 3.00288 -0.373636
N  1.325362 1.887732 -0.287329
C  -2.112609 -1.743406 0.802331
C  -2.813004 -1.936744 -0.571162
C  -2.431002 -3.070936 1.531766
C  -2.580257 -3.434336 -0.932338
C  -2.328678 -4.17158 0.43032
C  -0.021056 -0.423604 0.340189
C  -2.189122 3.170647 -0.262463
C  -0.056313 1.832118 -0.157273
C  1.940949 0.705263 -0.074367
C  -2.626322 4.346421 -1.158421
C  -2.616974 3.367409 1.211629
C  4.180672 -0.996286 0.108428
H  -2.49314 -0.85233 1.329714
H  -2.426456 -1.235787 -1.329451
H  -3.892916 -1.729265 -0.443594
H  -3.465635 -3.012957 1.915611
H  -1.769205 -3.251894 2.398032
H  -1.702682 -3.539273 -1.595206
H  -3.444443 -3.856167 -1.474557
H  -3.059486 -4.980175 0.605745
H  -1.329284 -4.646135 0.436167
H  -0.041529 -2.404119 0.784762
H  -2.640154 2.23122 -0.631063
H  -0.133066 3.812277 -0.581171
H  -3.722122 4.47043 -1.113627
H  -2.169633 5.296617 -0.819371
H  -2.339636 4.175972 -2.211337
H  -2.278681 2.514366 1.824174
H  -3.717899 3.435152 1.286676
H  -2.183847 4.295779 1.627637
H  3.250454 -1.543356 0.329767
