program: Gaussian 09
title: 000193022
version: EM64L-G09RevD.01
frameworkgroup: C1[X(C7H9NO3)]
method: RPBEPBE
basis: SDD
operation: Freq
keyword: #pfreq=noraman
keyword: PBEPBE/SDD
title: #p freq=noraman PBEPBE/SDD
converged: YES YES NO NO
title: Mulliken charges:
elementType: O O O N C C C C C C C H H H H H H H H H
charge: -0.436515 -0.213828 -0.281458 -0.393871 -0.142122 -0.511560 0.160953 0.260227 -0.771806 0.237841 -0.504924 0.302254 0.284430 0.263318 0.350196 0.254807 0.254974 0.215624 0.394117 0.277342
chargesum: 0.00000
title: Mulliken charges with hydrogens summed into heavy atoms:
elementType: O O O N C C C C C C C
charge: -0.042398 -0.213828 -0.281458 -0.043675 0.160132 0.036189 0.160953 0.260227 -0.046401 0.237841 -0.227582
polarizability: 9.67975813e+01 1.01291077e+00 7.52873460e+01 3.88268010e+00 6.44746731e+00 8.85875663e+01
1716.lowfreq: -9.3045 -7.2323 0.0009 0.0011 0.0012 3.7830 41.9304 54.5265 64.0890
frequency: 41.9270 54.5237 64.0752 68.1357 88.8803 126.6268 168.4907 217.2031 290.3868 328.9945 351.2381 355.7037 491.2640 524.8986 528.1472 569.1807 604.7008 615.0978 634.2664 651.2180 654.1870 738.4338 799.7377 857.0193 937.7347 950.0801 993.5771 1009.2085 1043.8064 1086.4718 1135.3371 1197.7337 1238.8442 1244.8727 1298.8223 1325.0283 1344.8681 1388.1592 1449.9602 1454.0501 1463.6900 1484.1206 1606.8666 1675.1674 2143.2190 2998.4354 3004.2314 3018.3227 3064.8303 3098.3195 3103.7151 3426.5652 3526.7944 3565.4804
redmass: 3.7224 8.2844 2.1457 1.9219 3.4501 4.0716 4.3891 4.1558 6.6163 3.5968 2.8111 4.5562 3.7514 3.3728 3.0913 1.4986 2.1690 2.7911 1.2440 1.6079 1.3900 4.4847 4.3457 3.3178 3.0751 3.4002 1.5896 3.1880 1.6559 1.8976 4.0534 1.1366 1.3254 1.5095 1.7811 2.3178 1.3274 1.2301 1.0471 1.0968 1.1619 1.9085 6.3454 9.2968 6.0367 1.0359 1.0606 1.0810 1.1022 1.0982 1.1007 1.1590 1.0644 1.0786
irintensity: 2.5566 3.8846 1.8084 8.5879 0.4209 3.6563 6.5527 1.0809 2.2889 5.6497 2.7672 4.2183 24.8874 28.3563 61.2851 35.3166 30.5444 25.8229 82.5630 190.8263 35.2680 4.6360 2.0692 3.8048 14.7743 53.7125 7.1102 31.3573 14.3687 161.6299 14.1535 16.1870 3.5213 19.6993 33.3155 48.4949 7.2588 63.3607 15.5826 26.1744 102.7741 238.5532 154.3048 223.6726 5.1516 8.7692 5.1261 13.4398 1.5596 9.3201 17.4834 61.8660 33.7088 50.9125
temp: 298.150 k
press: 1.00000 atm
elementType: 8 8 8 7 6 6 6 6 6 6 6 1 1 1 1 1 1 1 1 1
symmnumber: 1
zpe: 395381.6 jmol-1
zpe.correction: 0.150593 hartree
zpe.thermalcorrener: 0.162958 hartree
zpe.thermalcorrenthalpy: 0.163902 hartree
zpe.thermalcorrgfe: 0.110697 hartree
zpe.sumelectzpe: -551.689893 hartree
zpe.sumelectthermal: -551.677528 hartree
zpe.sumelectthermalent: -551.676584 hartree
zpe.sumelectthermalfe: -551.729789 hartree
dipole: 0.3362 -0.6793 4.1060
dipole: 4.1754
quadrupole: -69.2080 -62.1423 -61.9445
quadrupole: 1.1035 -1.6136 -2.0803
quadrupole: -4.7764 2.2893 2.4871 1.1035 -1.6136 -2.0803
hfenergy: -551.8404864 hartree
pointgroup: C01 [X(C7H9N1O3)]
dipole: -0.1683174 0.0960906 1.6312398 debye
dipolederiv: -0.3359952 -0.0063226 -0.0004096 -0.0441828 -0.4332576 -0.1598279 -0.1186465 -0.1965793 -1.1498338 -0.803467 0.2953685 -0.29222 0.2599285 -0.4931975 0.1217336 -0.0929282 -0.0257795 -0.648447 -0.7864146 0.0308077 0.0410041 0.063639 -0.3975883 -0.0055142 0.2906269 -0.0520582 -0.9135549 -1.2562326 0.0762451 0.1132339 0.1953444 -0.5241896 -0.0776182 0.0856305 -0.1197587 -0.439132 0.4018537 0.1737876 0.1569337 0.0805366 0.1711851 -0.0288573 0.467026 -0.084392 0.105036 -0.0549296 0.0802342 0.0147269 0.0069876 0.1472249 -0.0595676 -0.0598875 0.0161191 0.0998305 0.9364753 -0.5913632 0.2007131 -0.4249719 0.5913883 0.062939 0.1357338 0.2676235 1.4127345 1.6019248 -0.1996194 -0.1342326 -0.2955825 0.2432454 0.0320959 -0.3188181 0.0589117 1.0755732 -0.2722443 0.0505854 -0.217079 0.0708952 0.004295 0.061776 -0.2081951 0.0448435 -0.1298597 0.007181 0.0690949 -0.069793 0.0828646 0.0079904 -0.1144254 -0.1553527 -0.2139112 0.0117618 -0.3765097 -0.0656566 0.0110013 -0.0676895 -0.4239791 0.0168022 0.0884861 0.1316487 -0.3344892 0.0743224 -0.0426402 0.0352612 -0.0202474 0.0158862 0.0379357 -0.074099 0.0697993 0.0398096 0.0815492 0.0340042 0.0899067 0.0408986 0.0166994 0.008552 0.0787681 -0.0017105 0.0729981 0.0017216 -0.0152261 -0.0800919 -0.0409084 0.051284 0.0889061 -0.071707 0.0610594 0.0203947 0.2320512 -0.003413 -0.0048999 -0.009693 0.3475831 0.0202156 -0.0496173 0.0277753 0.1595869 0.1006178 0.0482833 -0.0032183 0.0851798 -0.0538237 -0.0020995 -0.0137144 -0.0376859 0.081968 -0.0021867 -0.0874762 0.0058453 -0.1203093 0.0473215 0.0056469 0.0153522 0.04139 0.0830727 0.0348196 0.0279791 0.1056013 0.0213721 0.1071829 -0.0353 0.0271823 -0.021778 -0.1172918 0.160124 0.1358954 0.0118728 0.1249971 0.3318867 0.0020863 -0.037775 0.0160169 0.3430225 0.2553391 -0.010568 0.0158438 -0.0090586 0.2428629 0.0245208 0.0119349 0.0184658 0.2268198 unknown
polarizability: 97.1172147|-0.6961821|76.8582815|-4.3394416|-7.3179964|86.6969975 unknown
InChI: InChI=1S/C7H9NO3/c1-3-4-6(7(10)11)8-5(2)9/h1,6,8,10H,4H2,2H3
charge 0 multiplicity 1
20 atoms
O  -1.220451 1.488758 1.454232
O  -2.306857 1.75311 -0.583757
O  2.435835 -0.118318 -1.217404
N  0.876322 0.260181 0.451644
C  -0.187829 0.507503 -0.520371
C  -0.747222 -0.812804 -1.164826
C  -1.339628 1.313503 0.068553
C  2.156487 -0.046457 0.021042
C  3.188868 -0.287096 1.114625
C  -1.335966 -1.73792 -0.18383
C  -1.833145 -2.508378 0.640886
H  0.2394 1.088841 -1.360349
H  0.101117 -1.290331 -1.688104
H  -1.500349 -0.531616 -1.924304
H  0.640544 0.311081 1.443788
H  3.575067 -1.317367 1.026539
H  4.042033 0.395219 0.959776
H  2.791472 -0.14074 2.133446
H  -2.010369 1.985864 1.798616
H  -2.27033 -3.187835 1.349597
