program: Gaussian 09
title: 000193028
version: EM64L-G09RevD.01
frameworkgroup: C1[X(C13H11N3S)]
method: RPBEPBE
basis: SDD
operation: Freq
keyword: #p
keyword: freq=noraman
keyword: PBEPBE/SDD
title: #p freq=noraman PBEPBE/SDD
converged: NO YES NO NO
title: Mulliken charges:
elementType: S N N N C C C C C C C C C C C C C H H H H H H H H H H H
charge: 0.232395 -0.412626 -0.032571 -0.002063 0.278543 0.021516 -0.189918 -0.778374 -0.355188 0.489606 -0.338385 -0.214144 -0.227703 -0.320352 -0.320346 -0.325681 -0.325681 0.316275 0.302751 0.302744 0.234575 0.245964 0.225233 0.225827 0.241343 0.241344 0.242459 0.242459
chargesum: 0.00000
title: Mulliken charges with hydrogens summed into heavy atoms:
elementType: S N N N C C C C C C C C C C C C C
charge: 0.232395 -0.096351 -0.032571 -0.002063 0.278543 0.021516 -0.189918 -0.172879 -0.120614 0.489606 -0.092421 0.011088 -0.001876 -0.079009 -0.079001 -0.083222 -0.083222
polarizability: 3.04818803e+02 -1.09232240e+01 1.36883640e+02 -1.76585023e-03 -1.43187161e-03 1.11532511e+02
1716.lowfreq: -6.6880 -0.0021 -0.0019 0.0004 2.8497 4.2763 11.7677 25.5260 41.9956
frequency: -1.5745 25.5034 41.9502 47.0103 108.6029 112.9234 204.5978 246.4207 259.0666 297.0801 320.5374 367.3251 391.8629 426.5502 465.7746 500.2324 555.5002 565.2864 578.4689 583.8326 612.9271 649.5495 661.1446 662.4275 751.7152 753.8386 767.4957 793.6989 810.1381 842.8788 856.3582 876.0554 884.2921 890.9087 930.6255 934.1921 960.4918 967.9465 975.7806 976.8271 1008.1650 1062.6028 1077.2455 1107.0734 1122.1946 1152.2367 1162.9223 1206.7390 1216.8845 1228.4379 1256.2637 1259.0498 1278.7694 1307.4606 1334.2241 1339.3865 1403.9354 1411.7850 1415.7968 1448.2306 1459.0579 1466.9626 1477.5432 1558.5575 1587.6511 1595.6629 1630.9425 3057.5128 3130.7287 3131.9363 3131.9733 3135.4847 3144.4326 3152.5552 3158.6312 3159.8178 3173.0244 3597.9394
redmass: 4.7786 3.8867 5.1809 7.2195 7.1965 7.7518 6.6138 4.4843 7.1274 5.9508 2.3533 2.4712 12.0323 2.9766 5.2760 4.6883 6.4541 1.2327 3.8641 8.2377 6.7321 5.4794 4.4155 6.8675 1.3443 2.9694 3.5467 5.1524 3.2306 1.8307 1.4854 6.5594 1.3003 1.4579 8.9111 1.3827 6.6642 1.3883 1.3040 1.4960 2.0615 2.2136 1.5311 1.7139 1.0741 1.7633 1.2215 2.8526 1.3930 1.7236 1.5403 3.1687 2.0081 7.9845 1.3118 3.0717 1.9902 3.0104 3.7338 1.1364 3.9773 2.0280 2.7787 6.9855 5.6653 6.8670 7.4974 1.0581 1.0872 1.0887 1.0861 1.1083 1.0905 1.0964 1.0994 1.0959 1.0992 1.0814
irintensity: 0.4371 1.0748 6.0394 0.9112 1.3192 0.4022 3.4293 6.1479 0.0645 1.3166 0.0136 0.0013 7.8917 10.9231 6.9281 8.3096 23.3995 89.5893 0.2183 12.7672 0.3185 10.4708 35.0148 0.2454 109.8983 6.5219 7.5959 0.9717 4.6189 36.5514 0.1078 1.6506 0.3396 1.1284 8.1817 4.1037 1.8052 0.2051 0.0505 0.0001 7.6786 5.9175 0.9441 3.2240 0.0091 19.6626 15.8981 12.0783 0.0913 1.6999 29.4860 66.3293 4.0312 0.2465 1.2920 62.2908 20.6550 116.3247 224.7407 13.6072 21.4863 4.9547 28.9122 11.7521 45.6245 1.1268 4.5883 4.1664 10.6628 11.3157 2.9515 0.2307 12.0595 41.2443 0.6258 26.2545 20.2732 50.3044
temp: 298.150 k
press: 1.00000 atm
elementType: 16 7 7 7 6 6 6 6 6 6 6 6 6 6 6 6 6 1 1 1 1 1 1 1 1 1 1 1
symmnumber: 1
zpe: 557505.5 jmol-1
zpe.correction: 0.212343 hartree
zpe.thermalcorrener: 0.225540 hartree
zpe.thermalcorrenthalpy: 0.226484 hartree
zpe.thermalcorrgfe: 0.170368 hartree
zpe.sumelectzpe: -1063.117651 hartree
zpe.sumelectthermal: -1063.104453 hartree
zpe.sumelectthermalent: -1063.103509 hartree
zpe.sumelectthermalfe: -1063.159625 hartree
dipole: -2.7601 -1.5565 -0.0001
dipole: 3.1687
quadrupole: -117.8897 -98.8162 -102.7682
quadrupole: 7.2745 -0.0020 0.0001
quadrupole: -11.3983 7.6752 3.7231 7.2745 -0.0020 0.0001
hfenergy: -1063.3299934 hartree
pointgroup: C01 [X(C13H11N3S1)]
dipole: -1.0838036 0.6160695 0.0000251 debye
polarizability: 304.8910152|10.3530006|136.8114282|0.001761|-0.0014379|111.5325114 unknown
InChI: InChI=1S/C13H11N3S/c1-2-4-12-11(3-1)15-13(16-12)17-9-10-5-7-14-8-6-10/h1-8,15H,9H2
charge 0 multiplicity 1
28 atoms
S  0.757242 1.225809 -0.000028
N  -2.019943 1.572519 -0.000053
N  -1.362385 -0.61905 0.000124
N  5.931018 -0.000507 -0.000113
C  -3.210974 0.820841 -0.000046
C  -2.778731 -0.549986 0.000061
C  -0.958372 0.658531 -0.000006
C  1.58756 -0.50455 0.000169
C  -4.570325 1.18753 -0.000114
C  3.084257 -0.32554 0.000071
C  -3.734589 -1.589322 0.000102
C  -5.511079 0.132566 -0.000073
C  -5.100291 -1.231191 0.000033
C  3.815373 -0.239526 1.212093
C  3.81524 -0.239731 -1.212046
C  5.218598 -0.081139 1.164028
C  5.218469 -0.081335 -1.164161
H  -1.939877 2.587733 -0.000096
H  1.211601 -1.021051 -0.895094
H  1.211697 -1.020815 0.895609
H  -4.895809 2.232917 -0.000194
H  -3.415133 -2.635755 0.000187
H  -6.580407 0.370408 -0.000121
H  -5.862868 -2.017477 0.000066
H  3.301906 -0.29711 2.178041
H  3.301666 -0.297477 -2.177928
H  5.806493 -0.015819 2.08654
H  5.806263 -0.016174 -2.086748
