program: Gaussian 09
title: 000193020
version: EM64L-G09RevD.01
frameworkgroup: C1[X(C10H9BrN2O5)]
method: RPBEPBE
basis: SDD
operation: Freq
keyword: #p
keyword: freq=noraman
keyword: PBEPBE/SDD
title: #p freq=noraman PBEPBE/SDD
converged: YES YES NO NO
title: Mulliken charges:
elementType: Br O O O O O N N C C C C C C C C C C H H H H H H H H H
charge: 0.031654 -0.186437 -0.176140 -0.189262 -0.194346 -0.187687 0.014084 0.026498 -0.546563 0.429971 -0.497345 0.224295 -0.351493 -0.495846 0.292833 0.412727 -0.386520 -0.788356 0.267133 0.255120 0.248903 0.300474 0.262483 0.331723 0.296124 0.318338 0.287635
chargesum: 0.00000
title: Mulliken charges with hydrogens summed into heavy atoms:
elementType: Br O O O O O N N C C C C C C C C C C
charge: 0.031654 -0.186437 -0.176140 -0.189262 -0.194346 -0.187687 0.014084 0.026498 -0.024311 0.429971 0.052032 0.224295 -0.089010 -0.164123 0.292833 0.412727 -0.090396 -0.182383
polarizability: 2.34953651e+02 -7.64367370e+00 1.74918027e+02 -1.85044991e+01 -1.56315071e+00 8.94189459e+01
1716.lowfreq: -4.3526 -0.0007 -0.0006 0.0002 3.8856 4.9540 11.5554 21.5491 37.4139
frequency: 11.3837 21.5247 37.4096 46.2674 52.1903 64.0200 95.9518 137.2060 149.9283 152.3701 162.0257 192.1850 267.5271 287.1423 331.3673 340.6752 383.4396 403.0736 430.9236 458.6936 497.2164 525.6866 537.4484 572.5943 621.2365 638.2681 652.6128 678.5299 712.9813 743.2682 758.8697 772.5416 784.3317 832.3335 866.9632 877.0711 904.3210 955.7148 993.8448 999.1813 1020.6639 1055.5508 1071.7324 1107.4810 1131.0688 1161.4303 1184.5097 1200.9967 1212.4146 1217.2703 1221.2568 1253.9191 1278.1630 1290.6209 1343.1115 1362.1999 1376.3042 1403.1620 1415.2221 1427.0302 1433.5249 1470.6756 1477.7483 1586.2319 1607.7551 1623.2905 2964.0239 3021.6294 3054.9482 3058.4718 3089.6141 3148.2525 3159.1782 3185.8562 3190.1240
redmass: 12.9147 12.8186 9.3700 9.8081 13.9894 6.3208 6.4565 3.7971 5.9560 9.1711 4.5582 6.2104 5.1465 5.0707 6.3277 7.6321 3.2085 4.4560 4.0943 4.3031 8.6335 3.9866 4.2067 4.1378 3.7540 5.8145 7.3965 8.8726 5.7881 5.4600 12.3377 5.2315 1.5164 2.0266 1.8628 3.2048 2.8184 1.4724 1.8145 1.4032 2.6679 2.2240 1.6652 2.7066 1.7047 1.1994 1.6976 4.7428 4.1265 1.9113 2.6324 1.2710 1.4053 1.3678 1.6773 5.1535 8.4257 7.1130 4.8876 1.1082 1.1066 2.6463 1.1534 8.7022 7.1789 8.5265 1.0672 1.0613 1.0582 1.0885 1.1018 1.0908 1.1100 1.0951 1.0927
irintensity: 0.7416 0.3149 2.1694 1.5261 0.2798 2.8065 4.7630 5.7317 3.2363 2.2483 2.7692 3.0482 0.6350 2.5328 1.1639 1.9488 4.9659 5.9063 0.9473 3.9582 2.4794 12.5724 5.3722 3.4177 8.6019 8.0378 12.2774 33.6150 12.2139 6.3508 16.2528 3.3103 1.1617 7.8151 20.7069 12.8140 2.3796 27.1893 6.1966 0.6703 28.7336 37.9313 1.0990 10.5618 12.6953 18.7689 40.1014 224.5317 75.4276 82.5264 129.5496 14.4369 28.2704 82.4671 56.9939 82.1236 58.8345 23.8116 58.8150 18.5101 36.7884 30.5386 12.4136 18.3083 88.6285 102.3289 15.1540 7.0636 10.1332 4.1563 6.0008 4.8517 1.5688 3.0822 17.9374
temp: 298.150 k
press: 1.00000 atm
elementType: 35 8 8 8 8 8 7 7 6 6 6 6 6 6 6 6 6 6 1 1 1 1 1 1 1 1 1
symmnumber: 1
zpe: 483026.7 jmol-1
zpe.correction: 0.183975 hartree
zpe.thermalcorrener: 0.201197 hartree
zpe.thermalcorrenthalpy: 0.202141 hartree
zpe.thermalcorrgfe: 0.133654 hartree
zpe.sumelectzpe: -884.053616 hartree
zpe.sumelectthermal: -884.036394 hartree
zpe.sumelectthermalent: -884.035450 hartree
zpe.sumelectthermalfe: -884.103937 hartree
dipole: -1.9859 -4.4955 -1.5560
dipole: 5.1550
quadrupole: -147.6894 -118.0734 -114.8677
quadrupole: -1.5302 13.0279 2.5630
quadrupole: -20.8126 8.8034 12.0091 -1.5302 13.0279 2.5630
hfenergy: -884.2375909 hartree
pointgroup: C01 [X(C10H9Br1N2O5)]
dipole: 0.8069932 1.7928806 -0.4977114 debye
polarizability: 236.2130657|-10.8478946|174.4494173|5.1167972|10.7232866|88.6281414 unknown
InChI: InChI=1S/C10H9BrN2O5/c11-6-9(14)4-2-7-1-3-8(12(15)16)5-10(7)13(17)18/h1,3,5H,2,4,6H2
charge 0 multiplicity 1
27 atoms
Br 5.364834 -0.83393 -1.306611
O  4.009312 1.651826 1.131164
O  -0.804742 -3.150293 0.501396
O  1.181646 -2.153318 0.003525
O  -4.907844 1.51803 -0.435201
O  -4.845663 -0.754392 -0.649533
N  -0.08367 -2.110595 0.258996
N  -4.291727 0.384657 -0.412008
C  1.410909 0.535973 0.883043
C  -0.059811 0.424915 0.525215
C  2.309936 0.717256 -0.366445
C  -0.763885 -0.784407 0.249788
C  -0.830966 1.620816 0.482165
C  -2.143544 -0.818063 -0.041259
C  3.719184 1.18058 0.001058
C  -2.840572 0.398506 -0.088547
C  -2.200957 1.6306 0.170727
C  4.783875 1.098611 -1.091608
H  1.764973 -0.350949 1.433146
H  1.555865 1.410181 1.542503
H  1.885257 1.487412 -1.046548
H  2.362798 -0.220675 -0.947129
H  -0.327859 2.565943 0.71306
H  -2.655102 -1.76638 -0.22409
H  -2.780075 2.556989 0.135187
H  5.685943 1.655391 -0.803302
H  4.407382 1.396916 -2.082791
