program: Gaussian 09
title: 000182440
version: EM64L-G09RevD.01
frameworkgroup: C1[X(C17H19NO4)]
method: RPBEPBE
basis: SDD
operation: Freq
keyword: #p
keyword: freq=noraman
keyword: PBEPBE/SDD
title: #p freq=noraman PBEPBE/SDD
converged: YES YES NO NO
title: Mulliken charges:
elementType: O O O O N C C C C C C C C C C C C C C C C C H H H H H H H H H H H H H H H H H H H
charge: -0.322773 -0.435234 -0.411913 -0.406444 -0.360474 -0.186671 0.360669 0.316007 -0.517168 -0.439979 -0.614365 -0.510240 0.554806 -0.532873 0.099681 0.209389 -0.589337 -0.429858 0.190818 -0.352153 0.143392 -0.522864 0.212163 0.203104 0.231161 0.192631 0.213501 0.213193 0.233889 0.287417 0.247281 0.244461 0.248764 0.235543 0.216486 0.378179 0.224942 0.226171 0.242114 0.353919 0.352665
chargesum: 0.00000
title: Mulliken charges with hydrogens summed into heavy atoms:
elementType: O O O O N C C C C C C C C C C C C C C C C C
charge: -0.322773 -0.057055 -0.057993 -0.053779 -0.073057 0.025492 0.360669 0.316007 -0.082904 -0.033847 -0.167283 -0.262959 0.554806 -0.288412 0.099681 0.209389 -0.340573 -0.194316 0.190818 -0.135668 0.143392 0.170363
polarizability: 3.10849126e+02 7.07486477e+00 1.95871083e+02 -1.51205542e+01 1.69352349e+01 1.30337546e+02
1716.lowfreq: -7.3066 -0.0005 0.0002 0.0005 3.4184 8.4496 22.4755 25.1746 37.1696
frequency: 21.7616 25.1699 37.1074 58.9746 74.3484 99.9276 126.8919 146.5259 158.8190 176.9861 214.7844 223.1370 257.4802 268.2398 280.0232 294.3869 303.0939 332.8610 337.7419 350.2863 367.1137 390.8415 393.9650 429.8178 437.4105 441.2531 451.6201 479.0615 482.8984 508.9733 515.4472 540.7632 564.0373 589.0196 621.8142 649.1815 658.6780 709.6110 713.1977 724.4548 728.3261 749.8401 770.3264 787.1112 800.6974 843.7598 854.0426 873.0306 879.0728 909.7168 929.3740 934.3004 949.7085 979.3908 1012.9132 1037.6568 1062.9306 1069.5395 1109.3535 1117.7206 1137.8401 1148.2374 1156.6725 1157.2903 1176.4627 1181.4943 1185.6461 1189.5975 1195.2636 1215.9534 1240.8690 1249.7362 1250.7906 1274.0735 1285.4401 1289.3310 1303.7178 1312.0425 1323.2890 1333.0546 1377.5215 1402.6562 1405.0351 1420.4273 1436.9740 1443.1126 1445.9403 1455.6112 1459.0238 1465.4017 1476.5897 1477.1149 1508.2645 1515.7435 1600.2820 1604.8727 1630.1204 1634.0314 2818.5872 2869.5688 2964.6133 2972.9963 3007.6985 3028.4392 3039.9687 3053.2690 3071.0624 3109.5265 3113.3623 3126.0346 3136.8251 3140.3985 3153.4822 3469.0140 3519.6708 3572.5418 3576.7045
redmass: 5.1591 4.5033 5.6450 4.3984 3.3801 5.1299 4.4405 5.5429 4.0891 3.3796 1.5069 5.1803 2.7208 2.7824 3.7008 4.9131 2.5573 2.1571 1.2012 3.7864 1.4368 4.4236 4.6465 3.5764 3.2283 3.7198 3.3208 1.1354 3.0726 2.9459 3.8543 4.1863 6.2793 3.2496 3.9068 2.4470 6.2117 3.2494 3.8714 4.6687 2.9221 4.3271 2.9208 3.3094 1.7211 1.4993 1.6591 1.5701 1.7905 1.3663 2.8155 2.8156 2.7833 3.5130 2.9884 3.1061 2.1602 2.3629 2.7704 1.2563 1.4338 1.9036 1.4107 1.3724 1.7349 1.5238 1.8050 1.6048 1.2092 1.6689 1.4851 1.6677 1.5163 1.5376 2.3261 2.6379 1.3993 1.4656 1.3707 1.7428 1.5134 5.7458 4.7796 3.3971 2.0920 1.3276 1.2352 1.4017 1.1447 1.0497 1.0810 1.1133 3.1873 3.1715 7.7920 6.5844 6.2268 6.8990 1.0799 1.0713 1.0326 1.0593 1.0592 1.1000 1.0909 1.1042 1.1027 1.0879 1.0910 1.0998 1.0907 1.0959 1.0907 1.0751 1.0646 1.0658 1.0662
irintensity: 0.3293 0.8807 0.4072 1.6980 2.3667 2.1571 2.6562 0.2339 1.9180 1.5522 1.1311 3.0008 2.1071 6.8770 0.9901 17.7275 5.7321 66.2762 17.9796 4.2579 185.3407 3.0087 7.7927 10.3580 2.8855 7.5098 5.8836 140.3421 1.6453 57.9587 5.0796 20.0860 4.9474 38.1862 5.0628 57.0085 6.1755 6.6810 2.1593 3.9986 2.0335 5.6689 16.3711 66.1723 20.0045 20.1650 17.6650 12.2045 9.5601 0.2386 18.1393 4.7294 10.3700 35.4117 6.8193 14.2562 37.5047 80.6235 68.4465 0.1918 436.0182 48.1436 32.2101 21.5932 79.9091 15.3363 13.1910 1.0983 27.1290 103.9785 9.9444 26.0823 47.1877 41.3163 126.6680 58.3029 27.8552 4.7790 7.7428 5.3049 34.6662 7.6763 8.2315 34.3501 4.6123 12.1454 18.0796 27.5374 10.0610 14.1958 73.4379 5.2631 197.5342 94.1112 17.6594 31.5215 14.4052 5.8540 57.9654 117.8193 62.9631 41.6086 24.8462 40.4522 54.2055 45.7205 14.0300 24.7139 9.7738 27.3770 13.9330 10.0198 5.7519 1.7209 85.6990 31.9192 44.7577
temp: 298.150 k
press: 1.00000 atm
elementType: 8 8 8 8 7 6 6 6 6 6 6 6 6 6 6 6 6 6 6 6 6 6 1 1 1 1 1 1 1 1 1 1 1 1 1 1 1 1 1 1 1
symmnumber: 1
zpe: 861106.7 jmol-1
zpe.correction: 0.327978 hartree
zpe.thermalcorrener: 0.348508 hartree
zpe.thermalcorrenthalpy: 0.349452 hartree
zpe.thermalcorrgfe: 0.278024 hartree
zpe.sumelectzpe: -1013.206792 hartree
zpe.sumelectthermal: -1013.186262 hartree
zpe.sumelectthermalent: -1013.185318 hartree
zpe.sumelectthermalfe: -1013.256747 hartree
dipole: -3.4282 1.9784 -0.9881
dipole: 4.0795
quadrupole: -116.7609 -124.3289 -125.4657
quadrupole: -18.9010 -10.9135 6.5141
quadrupole: 5.4242 -2.1437 -3.2805 -18.9010 -10.9135 6.5141
hfenergy: -1013.5347707 hartree
pointgroup: C01 [X(C17H19N1O4)]
dipole: 1.3832158 0.7510672 0.3141578 debye
polarizability: 309.138268|-11.8968758|194.9691|-20.8742589|-18.731599|132.9503876 unknown
InChI: InChI=1S/C17H19NO4/c1-22-17-8-11-4-5-18-13(12(11)9-16(17)21)6-10-2-3-14(19)15(20)7-10/h2-3,7-9,13,18-21H,4-6H2,1H3
charge 0 multiplicity 1
41 atoms
O  5.595163 -0.790899 -0.589652
O  3.927131 -2.866217 -0.245086
O  -5.396232 1.348699 -1.370481
O  -6.551776 -0.208048 0.523199
N  -0.438659 1.497727 0.311569
C  -0.025477 0.082771 0.416527
C  1.475773 -0.072579 0.13424
C  2.329242 1.053593 -0.016889
C  1.787109 2.471129 0.116295
C  0.48065 2.469415 0.931078
C  -0.89929 -0.762686 -0.569514
C  2.031306 -1.378166 0.066496
C  -2.388361 -0.650094 -0.280752
C  3.715142 0.854985 -0.262672
C  3.397419 -1.570536 -0.176782
C  4.246073 -0.441576 -0.35186
C  -3.192517 0.291977 -0.974478
C  -3.005879 -1.458418 0.704249
C  -4.571077 0.431364 -0.701914
C  -4.384363 -1.324605 0.986185
C  -5.178029 -0.384582 0.292547
C  6.551686 0.29975 -0.773486
H  -0.209587 -0.324977 1.445878
H  2.540773 3.124141 0.598423
H  1.571075 2.89387 -0.884686
H  0.712848 2.235185 1.999888
H  0.008003 3.468026 0.902845
H  -0.590879 -1.821281 -0.49905
H  -0.668807 -0.413338 -1.592066
H  -1.420901 1.623114 0.582997
H  1.411177 -2.269113 0.207057
H  4.363731 1.73127 -0.372263
H  -2.727599 0.924065 -1.743155
H  -2.412815 -2.202113 1.248672
H  -4.851506 -1.961854 1.749087
H  4.901766 -2.793258 -0.425123
H  6.607348 0.934399 0.131966
H  6.279164 0.921738 -1.647833
H  7.523111 -0.1854 -0.948907
H  -4.873083 1.842017 -2.05089
H  -6.861354 -0.834993 1.223738
