program: Gaussian 09
title: 000192981
version: EM64L-G09RevD.01
frameworkgroup: C1[X(C8H4INO2)]
method: RPBEPBE
basis: SDD
operation: Freq
keyword: #p
keyword: freq=noraman
keyword: PBEPBE/SDD
title: #p freq=noraman PBEPBE/SDD
converged: YES YES YES YES
title: Mulliken charges:
elementType: I O O N C C C C C C C C H H H H
charge: 0.333484 -0.177927 -0.177926 -0.647422 0.188422 0.188421 0.185669 0.185669 -0.346869 -0.346870 -0.207014 -0.207014 0.272718 0.272718 0.241971 0.241972
chargesum: 0.00000
title: Mulliken charges with hydrogens summed into heavy atoms:
elementType: I O O N C C C C C C C C
charge: 0.333484 -0.177927 -0.177926 -0.647422 0.188422 0.188421 0.185669 0.185669 -0.074152 -0.074152 0.034957 0.034957
polarizability: 1.96130792e+02 8.06248079e-05 1.24850595e+02 6.18590030e-03 2.10839221e-03 3.94843949e+01
1716.lowfreq: -5.9736 -0.0002 0.0003 0.0003 2.3081 4.4375 65.0126 115.6056 136.3196
frequency: 64.9910 115.6035 136.3178 161.9105 205.9914 232.4314 238.0953 338.6072 405.2524 455.4256 514.3604 556.3168 642.8787 656.6850 674.6958 696.6061 780.2171 782.4262 791.9350 837.5242 908.5791 975.3067 1007.3233 1010.1883 1025.5001 1073.6050 1129.1466 1165.1600 1177.0203 1237.6066 1281.7369 1413.5210 1451.9000 1455.1569 1614.6655 1615.7075 1644.0814 1682.5555 3142.2461 3156.2537 3168.4869 3177.3439
redmass: 9.3034 11.6545 4.9676 10.9980 19.2852 7.8230 7.2274 10.3560 3.0802 4.8525 7.5168 10.7103 9.7135 4.8467 8.1801 3.5176 7.2701 5.3118 1.5277 7.7868 1.3939 1.4090 1.3480 2.2543 9.6061 3.1739 3.8271 1.9152 1.1609 5.3210 1.4875 7.2707 2.4285 2.6651 7.5497 7.7429 12.7700 12.9199 1.0866 1.0909 1.0957 1.1003
irintensity: 5.4496 1.9886 0.0000 1.4302 0.9571 0.3376 0.5467 5.0319 0.9842 0.0000 9.1139 0.7864 35.2599 0.0000 1.1698 87.0940 17.1681 0.0000 38.9414 12.9035 0.0000 2.5579 0.0000 2.0940 131.7612 0.2655 2.7916 0.9319 10.1895 166.4089 0.3992 6.3114 13.5521 1.3499 30.2634 1.6995 489.4910 1.3917 1.9806 5.0710 3.9132 19.5390
temp: 298.150 k
press: 1.00000 atm
elementType: 53 8 8 7 6 6 6 6 6 6 6 6 1 1 1 1
symmnumber: 1
zpe: 267971.7 jmol-1
zpe.correction: 0.102065 hartree
zpe.thermalcorrener: 0.111765 hartree
zpe.thermalcorrenthalpy: 0.112709 hartree
zpe.thermalcorrgfe: 0.064923 hartree
zpe.sumelectzpe: -523.137627 hartree
zpe.sumelectthermal: -523.127927 hartree
zpe.sumelectthermalent: -523.126983 hartree
zpe.sumelectthermalfe: -523.174769 hartree
dipole: 3.6409 0.0000 0.0000
dipole: 3.6409
quadrupole: -55.0364 -91.5218 -84.0417
quadrupole: 0.0000 0.0011 0.0000
quadrupole: 21.8302 -14.6552 -7.1750 0.0000 0.0011 0.0000
hfenergy: -523.2396918 hartree
pointgroup: C01 [X(C8H4I1N1O2)]
dipole: 1.4324443 -0.000002 0.0000038 debye
dipolederiv: -0.0874032 0.0000579 -0.000008 -0.0001534 0.1646974 0.0000375 -0.0000509 0.0000619 0.1995772 -0.4359258 -0.2758107 0.0000079 -0.0370731 -1.0385403 0.0000107 -0.0001008 0.0001021 -0.3179968 -0.4358025 0.2758187 -0.0000093 0.0368467 -1.038451 0.0000203 0.0000485 -0.0000775 -0.318015 -0.1676034 -0.0000824 -0.0000338 0.000211 -1.3108332 -0.0000375 -0.0001408 -0.0000381 -0.3082431 -0.3761443 -0.1699672 -0.0000124 -0.1148889 -0.1032874 -0.0000135 -0.0000695 0.0000119 0.001885 -0.3762338 0.1699275 -0.0000283 0.114752 -0.1032679 0.0000026 -0.0000363 0.0000126 0.0018828 0.9192086 0.0544437 0.0000359 -0.4602858 1.5794829 -0.0000666 0.0002462 -0.0001458 0.2838448 0.9192405 -0.0544047 0.0000406 0.4604678 1.5793921 0.0000395 0.0000684 0.0000966 0.2838656 -0.1333902 0.093042 0.0000016 -0.142075 0.1424438 0. -0.0000017 -0.0000067 -0.0971902 -0.133524 -0.0930319 0.0000066 0.1420477 0.1424792 0.0000189 0.0000169 -0.000014 -0.0971899 0.1157664 -0.1113138 0.0000088 -0.0626994 -0.0434174 0.0000078 0.0000034 -0.0000118 -0.1380213 0.1159333 0.1112672 0.0000087 0.0624772 -0.0435029 0.000002 -0.0000152 0.000019 -0.1380184 0.1088108 -0.0266274 -0.0000047 0.0207612 -0.0171546 -0.0000075 0.0000298 -0.0000137 0.1621747 0.1087988 0.0266194 -0.0000003 -0.0204602 -0.0171587 -0.0000089 0.0000139 -0.0000005 0.1621766 -0.0709023 0.0763264 -0.000005 0.0768534 0.0535376 -0.0000018 -0.0000072 0.0000112 0.1596344 -0.0708288 -0.0762647 -0.0000081 -0.076781 0.0535803 -0.0000039 -0.0000048 -0.0000071 0.1596337 unknown
polarizability: 196.1307917|-0.0000385|124.8505947|0.0061859|0.0021084|39.4843949 unknown
InChI: InChI=1S/C8H4INO2/c9-10-7(11)5-3-1-2-4-6(5)8(10)12/h1-4H
charge 0 multiplicity 1
16 atoms
I  -3.824159 -0.000011 -0.000137
O  -1.380259 -2.370048 0.000049
O  -1.380251 2.370018 0.000033
N  -1.739002 -0.000014 -0.000134
C  0.471928 -0.708144 0.000031
C  0.47193 0.708108 0.000026
C  -0.946084 -1.198658 -0.000037
C  -0.94608 1.198627 -0.000045
C  1.66728 -1.441695 0.0001
C  1.667285 1.441655 0.00009
C  2.883337 -0.70891 0.000158
C  2.88334 0.708865 0.000153
H  1.654141 -2.535804 0.000107
H  1.65415 2.535764 0.00009
H  3.837869 -1.245676 0.000213
H  3.837873 1.245628 0.000205
