program: Gaussian 09
title: 000192962
version: EM64L-G09RevD.01
frameworkgroup: C1[X(C12H19NO)]
method: RPBEPBE
basis: SDD
operation: Freq
keyword: #p
keyword: freq=noraman
keyword: PBEPBE/SDD
title: #p freq=noraman PBEPBE/SDD
converged: YES YES NO NO
title: Mulliken charges:
elementType: O N C C C C C C C C C C C C H H H H H H H H H H H H H H H H H H H
charge: -0.475829 -0.390896 -0.190004 -0.439865 -0.034190 0.447569 -0.659892 -0.710024 -0.424569 -0.397882 0.435948 -0.393445 -0.379513 -0.809320 0.196604 0.221784 0.235989 0.199046 0.271271 0.208380 0.218029 0.224016 0.209646 0.221257 0.224474 0.224291 0.279263 0.224731 0.225033 0.359061 0.232022 0.224632 0.222382
chargesum: 0.00000
title: Mulliken charges with hydrogens summed into heavy atoms:
elementType: O N C C C C C C C C C C C C
charge: -0.116769 -0.119624 0.006600 0.017908 0.164856 0.447569 -0.009466 -0.054647 -0.200278 -0.118619 0.435948 -0.168714 -0.154480 -0.130283
polarizability: 1.92277266e+02 5.77410374e+00 1.32180570e+02 -1.30282292e+01 7.31721892e+00 9.97788157e+01
1716.lowfreq: -15.2750 -4.4882 -3.1753 0.0006 0.0007 0.0009 8.7609 17.9091 41.0322
frequency: 0.5503 17.6596 40.4474 54.9348 55.6952 110.3615 153.0152 199.9966 205.0606 220.9878 246.9320 283.3592 317.7589 334.8379 370.4625 387.3538 406.8084 428.5676 464.0517 519.4916 537.9409 563.5880 636.6753 651.3379 723.4787 752.9563 783.6750 808.2744 818.6302 832.7259 858.5866 882.3946 921.2226 938.9801 949.1213 952.4912 982.5290 986.0231 1012.5252 1025.9644 1046.9237 1048.4956 1078.4450 1116.7850 1129.7832 1148.0206 1176.7481 1181.1316 1209.6319 1219.3983 1222.4360 1261.3169 1291.6695 1303.2391 1315.2113 1335.0313 1350.9741 1378.5616 1379.6886 1394.3515 1395.7833 1397.2922 1404.6143 1445.4631 1455.2988 1466.1164 1472.3668 1472.8864 1474.5242 1479.2047 1488.2989 1508.4380 1585.4416 1625.9134 2894.3543 2900.4648 2952.4042 2972.1667 2974.7830 2983.6895 3052.8637 3066.2502 3067.7521 3080.6971 3081.6002 3085.5941 3091.2839 3102.5674 3117.8726 3130.0209 3165.2950 3216.9788 3432.7261
redmass: 1.1014 2.8552 3.2962 4.2104 2.7674 3.1309 3.7005 2.1458 1.5509 2.2597 1.1116 3.7302 3.5308 2.9907 2.4448 3.2939 2.8863 2.2902 2.6176 3.0502 2.9780 3.3056 6.8415 1.3734 3.2353 2.9260 1.2163 2.7332 1.7425 2.3176 1.2794 2.7103 1.1951 1.7504 1.3536 1.5681 1.4262 1.3658 2.8708 3.3146 1.5705 2.7862 2.9746 1.3303 1.8021 1.8657 1.7219 1.3066 2.5590 2.5106 1.4151 1.1971 1.2251 1.2162 1.2459 1.4084 1.3324 3.9166 1.2409 1.2171 1.2403 1.7635 2.5010 1.2053 1.0774 1.0491 1.0890 1.0569 1.1022 1.0578 1.0537 2.8063 6.2383 6.4608 1.0834 1.0830 1.0678 1.0385 1.0364 1.0358 1.0950 1.0958 1.0978 1.0993 1.0996 1.0997 1.0992 1.0869 1.0898 1.0962 1.0940 1.0631 1.0745
irintensity: 0.4753 0.2488 0.2456 3.2483 0.3258 1.0147 3.0634 0.9372 1.4252 5.8812 0.0739 1.5065 6.3138 1.1161 0.9188 5.0173 0.5059 0.5238 5.4787 4.6899 6.7638 16.7941 0.4021 23.0156 0.0359 27.7095 125.4204 3.3276 40.0741 26.6832 11.2032 17.1105 3.6873 3.9955 2.4024 2.6263 0.3434 3.2936 9.1013 14.9301 18.8380 46.3887 15.4192 11.2648 4.9982 69.9180 22.5401 33.4527 15.1489 1.6711 11.2167 13.4074 10.7698 17.0215 11.7268 18.3505 15.9403 12.9328 21.6760 28.8307 12.7101 54.6769 4.8810 25.5761 4.3119 0.7775 14.3044 11.7388 10.0679 8.9124 16.5262 30.8565 0.3586 0.5207 69.9013 60.2784 55.2214 44.8420 33.8185 14.9276 26.0989 5.2245 47.1667 26.9086 19.3695 27.5891 64.0247 17.1629 27.5492 25.2849 3.5779 212.8898 0.1825
temp: 298.150 k
press: 1.00000 atm
elementType: 8 7 6 6 6 6 6 6 6 6 6 6 6 6 1 1 1 1 1 1 1 1 1 1 1 1 1 1 1 1 1 1 1
symmnumber: 1
zpe: 748062.6 jmol-1
zpe.correction: 0.284922 hartree
zpe.thermalcorrener: 0.300527 hartree
zpe.thermalcorrenthalpy: 0.301472 hartree
zpe.thermalcorrgfe: 0.236102 hartree
zpe.sumelectzpe: -597.554686 hartree
zpe.sumelectthermal: -597.539081 hartree
zpe.sumelectthermalent: -597.538137 hartree
zpe.sumelectthermalfe: -597.603506 hartree
dipole: -2.1071 -1.3515 -2.8135
dipole: 3.7659
quadrupole: -71.0534 -79.7850 -93.4336
quadrupole: 3.1754 -0.6187 -0.2327
quadrupole: 10.3706 1.6390 -12.0096 3.1754 -0.6187 -0.2327
hfenergy: -597.8396081 hartree
pointgroup: C01 [X(C12H19N1O1)]
dipole: -0.8257775 -0.1011717 1.2260026 debye
polarizability: 191.86198|-13.0743692|117.5207066|8.1722338|17.6391251|114.8539659 unknown
InChI: InChI=1S/C12H19NO/c1-9(2)13-8-12(14)11-6-4-10(3)5-7-11/h4-7,9,12-14H,8H2,1-3H3
charge 0 multiplicity 1
33 atoms
O  -1.025642 0.645466 -1.705972
N  -2.851816 0.569828 0.245244
C  -0.499381 0.997745 -0.392441
C  -1.44714 0.353222 0.675219
C  -3.853439 -0.478148 0.614953
C  0.9319 0.510421 -0.234881
C  -3.677872 -1.729816 -0.271671
C  -5.266279 0.118646 0.45653
C  1.768018 1.058021 0.768963
C  1.442933 -0.521159 -1.057703
C  3.597517 -0.470286 0.144151
C  3.080869 0.572108 0.956476
C  2.757802 -1.000145 -0.869696
C  5.001655 -1.009821 0.361725
H  -0.525213 2.104749 -0.25773
H  -1.220962 0.754724 1.686163
H  -1.253758 -0.733296 0.694774
H  -3.719563 -0.781838 1.680817
H  -3.187586 1.508835 0.502238
H  -4.385257 -2.521149 0.037272
H  -3.869832 -1.475692 -1.329851
H  -2.656695 -2.144552 -0.202208
H  -5.416625 0.986191 1.127747
H  -6.036206 -0.63384 0.700837
H  -5.425553 0.452323 -0.585534
H  1.40041 1.879488 1.398253
H  0.803598 -0.911937 -1.855012
H  3.716253 1.012454 1.735232
H  3.143256 -1.791882 -1.524719
H  -2.020091 0.583109 -1.532356
H  4.997073 -1.862412 1.068989
H  5.447108 -1.370667 -0.582395
H  5.67162 -0.23899 0.782485
