program: Gaussian 09
title: 000192952
version: EM64L-G09RevD.01
frameworkgroup: C1[X(C11H13NO)]
method: RPBEPBE
basis: SDD
operation: Freq
keyword: #p
keyword: freq=noraman
keyword: PBEPBE/SDD
title: #p freq=noraman PBEPBE/SDD
converged: YES YES NO NO
title: Mulliken charges:
elementType: O N C C C C C C C C C C C H H H H H H H H H H H H H
charge: -0.228319 -0.299930 -0.155208 -0.507478 -0.488223 -0.521060 0.096232 0.298365 -0.341652 -0.346110 -0.242060 -0.225095 -0.221481 0.262158 0.229489 0.239618 0.235037 0.231388 0.270165 0.250417 0.241481 0.244616 0.277332 0.231776 0.234203 0.234339
chargesum: 0.00000
title: Mulliken charges with hydrogens summed into heavy atoms:
elementType: O N C C C C C C C C C C C
charge: -0.228319 -0.029765 0.106950 -0.038371 -0.021798 -0.029161 0.096232 0.298365 -0.097036 -0.068778 -0.010284 0.009108 0.012858
polarizability: 1.73697626e+02 -9.65814399e+00 1.21855021e+02 -9.65168679e+00 -5.58410439e+00 7.77871738e+01
1716.lowfreq: -18.0640 -6.0341 -0.0006 -0.0002 0.0005 7.0486 31.7648 36.0172 59.6574
frequency: 31.6420 35.5199 59.6557 77.5300 150.2459 161.3051 216.4739 271.1916 303.8156 398.1618 402.3574 412.4823 441.1899 491.0376 557.9157 613.3845 650.5836 667.7397 696.1708 748.8657 767.7688 780.5193 804.2244 831.6415 858.8664 905.8337 933.1483 949.9729 968.0813 989.6670 991.7522 1010.0701 1027.0833 1030.4359 1032.8038 1061.0518 1084.6909 1108.8587 1118.1759 1166.4919 1172.1280 1174.2423 1189.5775 1217.6496 1227.8636 1252.5430 1305.5899 1323.5309 1363.5892 1387.0644 1421.5392 1424.9076 1435.9569 1447.3688 1468.8460 1480.2540 1571.1673 1598.6990 1612.4273 2958.5591 3031.5486 3041.8744 3097.6523 3108.1140 3128.9199 3138.5940 3149.6858 3158.7029 3169.3044 3201.0594 3218.5773 3451.4319
redmass: 4.3506 3.4154 3.5756 3.3714 4.9101 4.3347 2.6559 2.8944 5.7773 2.7919 2.3616 3.1228 4.1217 3.3361 2.5186 6.4270 2.2789 3.0396 1.8103 1.7410 1.8290 2.7671 1.6618 1.3563 1.2509 2.3655 2.5142 1.8362 4.5502 6.0267 1.3933 1.3579 2.0529 2.1032 1.2020 1.2945 1.5754 1.5046 1.4655 1.4960 1.5808 1.3209 1.1813 1.8833 2.1089 1.2584 1.4836 1.3585 1.7616 9.1716 1.1113 1.0940 2.2175 1.2952 1.3295 2.1225 6.9609 6.8632 6.5843 1.0639 1.0950 1.0876 1.0507 1.0629 1.0851 1.0880 1.0923 1.0962 1.1014 1.1173 1.1155 1.0736
irintensity: 0.1617 0.8944 2.4495 3.2416 0.7217 0.5899 11.3832 2.1978 8.3085 0.5416 17.6702 1.7431 7.5519 6.8869 16.8070 0.2276 43.0783 104.5618 49.4545 29.9084 36.0323 17.9158 14.8024 10.1664 0.3556 7.9981 10.7938 4.6644 32.5557 2.3514 0.5111 0.8188 2.2498 3.8007 36.8587 7.3667 10.7710 7.1844 0.0677 3.3901 31.4394 5.7786 11.4174 91.9393 58.1328 5.4241 7.2704 14.6139 27.0948 2.6024 24.8576 4.2587 23.2818 17.6279 7.4401 1.1153 91.3435 46.6655 8.2771 52.1534 9.3038 36.4318 22.5012 11.5254 0.1931 5.7390 14.7346 23.7637 20.9838 0.3936 28.1992 1.7269
temp: 298.150 k
press: 1.00000 atm
elementType: 8 7 6 6 6 6 6 6 6 6 6 6 6 1 1 1 1 1 1 1 1 1 1 1 1 1
symmnumber: 1
zpe: 560674.0 jmol-1
zpe.correction: 0.213549 hartree
zpe.thermalcorrener: 0.225699 hartree
zpe.thermalcorrenthalpy: 0.226643 hartree
zpe.thermalcorrgfe: 0.173360 hartree
zpe.sumelectzpe: -555.941162 hartree
zpe.sumelectthermal: -555.929013 hartree
zpe.sumelectthermalent: -555.928068 hartree
zpe.sumelectthermalfe: -555.981352 hartree
dipole: 2.4278 -1.9474 -0.2011
dipole: 3.1188
quadrupole: -69.1782 -76.7333 -77.6514
quadrupole: -2.2712 -0.6489 -1.3838
quadrupole: 5.3428 -2.2124 -3.1304 -2.2712 -0.6489 -1.3838
hfenergy: -556.1547118 hartree
pointgroup: C01 [X(C11H13N1O1)]
dipole: -0.9345259 -0.757063 -0.2431863 debye
dipolederiv: -0.8599262 -0.1310684 0.0142604 -0.3302743 -0.6986451 -0.1767171 -0.1027527 -0.2148611 -0.4140807 -0.832022 0.0391566 0.0744055 0.0773462 -0.1533155 -0.0698649 0.0431978 0.0220993 -0.5709335 0.2707716 0.0096908 0.1092885 -0.1293474 0.1895383 -0.0647202 0.2580774 -0.070236 0.4391648 -0.2444659 -0.0584831 0.0104137 -0.1191326 -0.0081504 0.016669 -0.0068397 0.040684 0.0994814 0.008949 0.0065936 0.0017943 0.0381207 -0.2388924 0.0245719 -0.0249006 0.0044604 0.0926416 0.4679961 0.0499176 0.0790784 0.3170399 0.0566833 -0.0431734 0.182855 -0.0867405 0.0822446 1.4999476 0.2572889 -0.1837988 0.3543708 0.6207105 0.2426911 -0.1540542 0.2840685 0.3206124 -0.7783241 -0.1845131 0.0587399 -0.104022 -0.0988869 -0.0159528 0.1393866 -0.0049386 -0.0334648 0.1089806 -0.0276593 -0.0934987 0.1246535 -0.0317471 0.0377963 0.0077338 0.0725509 -0.0762399 0.0043493 0.1297407 0.0508922 -0.0914662 -0.0057263 0.0810473 -0.0917961 0.0295489 -0.0603371 -0.2286521 0.0634902 0.0608639 0.107873 0.0530001 0.1190117 0.1035129 0.1295156 -0.0896627 -0.0337149 -0.1369547 -0.1408594 -0.1342816 -0.1067605 0.0723756 -0.1294384 0.0768625 -0.0610982 0.1217251 0.0633504 -0.0368494 0.0409976 -0.0145117 0.0721851 -0.0501516 0.0654668 -0.0721363 -0.0012477 0.0748267 0.0577268 0.0833171 0.0293759 -0.0454272 -0.0264922 -0.0172234 -0.1691655 -0.0281651 -0.057768 -0.0655686 -0.061554 0.0782317 -0.0406466 -0.1180684 -0.0527705 -0.0451436 0.0410268 -0.0468417 0.0410257 -0.0559327 0.0945727 0.0283266 0.102814 0.0383878 -0.0469124 0.1320311 -0.0439451 -0.0276105 -0.0291464 -0.0106241 -0.0556783 -0.0105294 -0.0967385 -0.0297346 0.1030834 -0.013895 0.0013963 0.0048912 -0.0154264 0.0742066 -0.0191325 0.10803 -0.0715444 0.1837433 0.0683399 -0.1123048 -0.0236556 0.0119807 0.0683514 -0.208594 -0.032263 0.2413823 -0.0967795 0.015973 -0.0889551 0.0192047 0.0925102 0.0094933 -0.1399436 0.0045554 -0.0757806 0.0686411 -0.0143952 0.0270792 -0.0693894 -0.0808248 0.0307743 0.0542163 0.0533559 0.082161 0.0252627 0.0638845 0.0858132 0.0766324 0.0707073 -0.0650208 0.090287 -0.0653095 0.0703108 0.132839 -0.0505493 -0.0248915 -0.0078142 0.0406683 -0.0761027 -0.0012562 -0.0638728 0.1047612 0.0602925 -0.0529606 -0.0099487 -0.0737406 -0.0286384 -0.1136647 -0.022573 -0.1168236 0.08125 -0.0264571 0.0508086 0.0881131 0.0610965 0.0621044 -0.0864805 0.1006699 -0.0838115 0.0691857 -0.0998845 -0.074028 0.0233944 -0.0757868 0.0920664 -0.024051 0.0237722 -0.023997 0.1330385 unknown
polarizability: 172.862953|14.6926622|110.8097298|-5.6519484|20.1166577|89.6671384 unknown
InChI: InChI=1S/C11H13NO/c13-11(8-12-10-6-7-10)9-4-2-1-3-5-9/h1-5,10,12H,6-8H2
charge 0 multiplicity 1
26 atoms
O  0.48468 1.702965 0.582646
N  2.571353 0.424789 -0.808522
C  3.26348 0.077474 0.425559
C  4.788804 -0.030492 0.368214
C  3.933685 -1.303608 0.489711
C  1.20179 -0.082487 -0.919657
C  0.153287 0.655779 -0.047661
C  -1.252964 0.129887 0.00837
C  -1.658361 -1.035915 -0.698111
C  -2.208506 0.828533 0.796782
C  -2.991574 -1.491592 -0.615306
C  -3.538102 0.371802 0.880452
C  -3.933112 -0.790482 0.173762
H  2.835547 0.456473 1.367278
H  5.363594 0.300095 1.238031
H  5.257316 0.158703 -0.601412
H  3.853981 -1.929311 -0.403936
H  3.925943 -1.841788 1.441765
H  2.619416 1.435537 -0.993478
H  0.862022 -0.014435 -1.974923
H  1.20518 -1.158461 -0.660444
H  -0.942355 -1.590714 -1.313228
H  -1.876984 1.725028 1.331635
H  -3.297481 -2.390176 -1.162058
H  -4.26727 0.915057 1.491342
H  -4.96737 -1.146862 0.237791
