program: Gaussian 09
title: 000192944
version: EM64L-G09RevD.01
frameworkgroup: C1[X(C5H6N6)]
method: RPBEPBE
basis: SDD
operation: Freq
keyword: #p
keyword: freq=noraman
keyword: PBEPBE/SDD
title: #p freq=noraman PBEPBE/SDD
converged: NO NO NO NO
title: Mulliken charges:
elementType: N N N N N N C C C C C H H H H H H
charge: -0.176634 -0.048814 -0.057384 0.034070 -0.066885 -0.629570 0.151480 -0.102045 0.205631 -0.641424 -0.353643 0.281290 0.239089 0.239181 0.249152 0.345039 0.331468
chargesum: 0.00000
title: Mulliken charges with hydrogens summed into heavy atoms:
elementType: N N N N N N C C C C C
charge: -0.176634 -0.048814 -0.057384 0.034070 -0.066885 0.046937 0.151480 -0.102045 0.205631 0.118136 -0.104491
polarizability: 1.20521164e+02 2.54545020e+00 1.15289157e+02 2.47518246e-03 -2.08473271e-03 4.36291416e+01
1716.lowfreq: 0.0002 0.0004 0.0005 7.9190 13.8901 13.9478 94.8357 160.2227 203.3132
frequency: 94.8222 160.2132 203.3108 211.5040 219.7115 313.9284 340.0273 383.0597 489.9699 520.2740 537.9747 562.8289 569.6683 614.8642 645.0483 672.2630 740.0035 793.9788 836.1838 877.1468 935.2619 960.9747 1060.7271 1119.9111 1129.2288 1156.4579 1196.3778 1240.6928 1296.7118 1321.1068 1353.9755 1390.2858 1426.2999 1443.9466 1477.1160 1479.9193 1518.6110 1587.1532 1627.7833 2986.3717 3073.7074 3119.2673 3172.0750 3545.1048 3704.6986
redmass: 3.3991 1.1659 6.4967 3.8422 3.2163 5.3248 3.1215 1.1384 6.5961 7.1985 1.2629 5.7844 4.2197 5.7459 6.5059 11.0843 6.7762 11.6144 6.7830 6.3680 1.4266 2.1631 9.7791 1.3050 2.8581 3.4057 4.3848 5.8127 2.9976 7.4579 2.8222 2.8616 2.1268 1.6187 1.0435 1.0668 7.2311 2.4177 1.9851 1.0348 1.1031 1.0982 1.0923 1.0461 1.1036
irintensity: 0.2577 2.4211 1.1964 2.5730 0.4289 0.0038 6.2578 141.2125 0.5009 0.4362 133.8606 2.7660 8.4099 21.1170 1.9369 6.1682 10.7945 5.4352 50.1712 24.8064 12.5379 15.8991 0.2202 0.2700 10.3609 37.0677 8.4592 2.4955 7.6058 40.5651 17.0409 15.0939 15.5353 29.9086 20.7890 36.9138 100.1006 34.9109 461.0342 36.0047 20.2604 1.1024 15.8644 94.0829 37.7508
temp: 298.150 k
press: 1.00000 atm
elementType: 7 7 7 7 7 7 6 6 6 6 6 1 1 1 1 1 1
symmnumber: 1
zpe: 323652.9 jmol-1
zpe.correction: 0.123273 hartree
zpe.thermalcorrener: 0.132211 hartree
zpe.thermalcorrenthalpy: 0.133155 hartree
zpe.thermalcorrgfe: 0.089449 hartree
zpe.sumelectzpe: -521.812566 hartree
zpe.sumelectthermal: -521.803628 hartree
zpe.sumelectthermalent: -521.802684 hartree
zpe.sumelectthermalfe: -521.846389 hartree
dipole: 2.2489 7.9915 0.0007
dipole: 8.3019
quadrupole: -62.5153 -65.4686 -64.3839
quadrupole: 7.6267 0.0015 0.0025
quadrupole: 1.6073 -1.3460 -0.2613 7.6267 0.0015 0.0025
hfenergy: -521.9358387 hartree
pointgroup: C01 [X(C5H6N6)]
dipole: -0.590129 3.212478 -0.0002714 debye
dipolederiv: -0.3372691 0.045236 0.0001262 0.2123272 -0.6544557 -0.0004056 -0.0001289 0.0005991 -0.0528182 -0.2775341 -0.2252871 -0.0011033 -0.062152 0.7616717 -0.0001218 -0.0003028 0.000388 -0.1970749 -0.3262554 0.5928732 0.0003272 0.031121 -0.2400869 0.0006394 -0.0000291 -0.0007216 -0.1709854 -0.669723 0.0853467 -0.0003543 -0.0813988 -0.4806717 0.0002189 0.0002468 -0.0000397 -0.1906547 -0.5498203 0.4212488 0.0000513 -0.0435857 -0.8293059 -0.0001785 -0.0001268 0.0001236 -0.2353241 -0.1617147 0.0813081 -0.0000514 -0.0444528 -1.4649435 0.0001688 0.0000492 0.0003431 -0.6978374 0.0975217 -0.3980783 0.0002928 -0.0958513 -0.6188669 0.0000243 -0.0003764 -0.0000167 0.0942026 0.5759074 -0.3128862 0.0007276 0.0747348 0.1264111 -0.0002905 0.000467 -0.0000205 0.1088409 0.4383846 -0.0684045 -0.0000855 0.0300269 1.794399 -0.0001957 0.0001016 -0.0001089 0.2254961 0.2344056 -0.2077894 0.0001022 -0.2596573 0.3104385 0.0001025 0.0001841 0.0002569 0.2449925 0.5829664 -0.1069873 -0.0000215 0.0656179 0.6887678 0.0001501 -0.0006336 -0.0002672 -0.0620601 -0.0160318 0.0110345 0.0000286 -0.1058838 0.1042044 0.0000425 0.0001144 -0.0000365 0.142395 0.0764124 -0.0064034 -0.0716196 0.0859803 -0.0378195 -0.0742381 -0.0149556 -0.1002173 -0.0434265 0.0766038 -0.006277 0.0715222 0.0858819 -0.0374756 0.0741071 0.0149533 0.0999585 -0.0434323 -0.0635824 0.060569 0.0000123 0.0476899 0.0751407 0.0000047 0.0003991 -0.0000444 0.13136 0.1881454 0.0552088 -0.0000123 0.0428297 0.2576817 -0.0000184 0.000024 -0.0000396 0.381727 0.1315835 -0.0207119 0.0000574 0.016772 0.2449109 -0.0000099 0.0000137 -0.0001566 0.3645995 unknown
polarizability: 120.0074304|-2.9838319|115.8028913|0.0026574|0.0018468|43.6291416 unknown
InChI: InChI=1S/C5H6N6/c1-11-3-4(6)7-2-8-5(3)9-10-11/h2H,6H2,1H3
charge 0 multiplicity 1
17 atoms
N  -1.581514 0.336658 -0.000046
N  -2.138175 -0.978687 0.001297
N  -1.131232 -1.864893 -0.001554
N  1.348603 -1.682133 0.000189
N  2.166283 0.635337 0.000153
N  0.791781 2.532162 -0.000131
C  -0.201792 0.252106 0.000021
C  0.084696 -1.150654 0.000236
C  0.906965 1.159361 -0.000041
C  -2.490199 1.481494 -0.000373
C  2.318362 -0.733631 0.000587
H  -3.514394 1.077828 0.000082
H  -2.354181 2.100516 0.904572
H  -2.354688 2.099863 -0.905852
H  3.352829 -1.088956 -0.000327
H  1.657349 3.070013 -0.00008
H  -0.102994 3.011619 0.000068
