program: Gaussian 09
title: 000192936
version: EM64L-G09RevD.01
frameworkgroup: C1[X(C7H13NO2)]
method: RPBEPBE
basis: SDD
operation: Freq
keyword: #p
keyword: freq=noraman
keyword: PBEPBE/SDD
title: #p freq=noraman PBEPBE/SDD
converged: YES YES NO NO
title: Mulliken charges:
elementType: O O N C C C C C C C H H H H H H H H H H H H H
charge: -0.417917 -0.245842 -0.637006 0.287768 0.008830 -0.528507 -0.498799 -0.469193 -0.754944 0.107766 0.230292 0.232849 0.234619 0.220812 0.230562 0.183255 0.230661 0.208106 0.214952 0.219353 0.262667 0.297671 0.382047
chargesum: 0.00000
title: Mulliken charges with hydrogens summed into heavy atoms:
elementType: O O N C C C C C C C
charge: -0.035870 -0.245842 -0.076668 0.287768 0.239121 -0.061040 -0.047424 -0.055278 -0.112533 0.107766
polarizability: 1.02830754e+02 -1.77060078e+00 8.22032363e+01 1.18976810e+00 -1.57778003e+00 7.27607850e+01
1716.lowfreq: -29.5398 -14.8142 0.0009 0.0009 0.0010 6.9058 13.3639 59.1436 155.1276
frequency: -22.8933 59.0823 155.1185 203.2279 213.7748 232.1679 264.9071 301.0286 364.0371 371.7698 412.8064 449.7488 494.1349 542.2771 564.8157 591.0064 629.0808 695.2257 736.0297 804.5458 855.8993 862.3052 912.2481 931.6806 950.7974 992.8450 1011.9168 1038.7335 1054.1660 1068.5251 1109.2773 1134.9750 1183.8629 1217.4635 1237.1791 1253.1911 1267.8004 1289.2862 1299.3367 1311.1744 1342.1654 1347.3676 1386.5673 1456.4880 1461.9058 1471.6507 1475.0518 1478.2454 1603.9373 1658.2598 2964.9069 2968.0097 2978.3466 2998.1769 3011.8261 3051.1919 3062.2893 3066.1955 3074.6744 3088.5209 3459.3802 3520.4558 3599.9058
redmass: 3.1397 8.8917 2.5318 1.7133 1.4323 1.8966 1.5940 2.3170 2.5784 4.5708 1.8632 2.5670 3.0343 2.7156 1.5939 1.3137 2.9902 3.1095 4.4096 2.3839 1.9019 2.1471 1.7357 1.8124 1.4969 1.8437 3.2133 1.5430 2.1004 1.4739 2.3727 1.9913 1.7948 1.5464 1.6969 1.6834 1.3751 1.3842 1.3507 1.3920 1.7219 2.2803 1.2163 1.0864 1.0848 1.0731 1.0534 1.0695 1.4105 3.1675 1.0656 1.0414 1.0773 1.0612 1.0633 1.0976 1.0990 1.0991 1.1039 1.1012 1.0447 1.0640 1.0988
irintensity: 0.2343 1.0431 0.7140 0.3193 0.0645 15.0851 29.0178 3.0044 9.7711 2.1942 5.4156 10.4150 13.4813 44.8253 101.9473 179.0964 40.1031 36.0789 14.5893 0.9726 10.1808 4.4031 0.8548 2.4168 17.5531 7.8375 4.6983 50.1347 207.8891 9.9984 0.4029 5.5067 4.0493 1.0860 2.4424 3.5645 2.9770 5.1242 8.0951 2.3656 4.1788 8.2343 11.1370 11.6224 5.2501 3.6406 8.4135 14.1588 183.8955 162.6342 11.0949 41.5214 38.6077 26.4465 21.0429 25.2525 51.2296 37.3529 38.4426 27.9375 7.4703 26.1009 6.7176
temp: 298.150 k
press: 1.00000 atm
elementType: 8 8 7 6 6 6 6 6 6 6 1 1 1 1 1 1 1 1 1 1 1 1 1
symmnumber: 1
zpe: 511959.6 jmol-1
zpe.correction: 0.194995 hartree
zpe.thermalcorrener: 0.204866 hartree
zpe.thermalcorrenthalpy: 0.205810 hartree
zpe.thermalcorrgfe: 0.160445 hartree
zpe.sumelectzpe: -478.943938 hartree
zpe.sumelectthermal: -478.934067 hartree
zpe.sumelectthermalent: -478.933123 hartree
zpe.sumelectthermalfe: -478.978487 hartree
dipole: 1.7321 -0.3534 1.4808
dipole: 2.3060
quadrupole: -65.8053 -54.3748 -63.1364
quadrupole: 5.3078 -2.8224 0.4749
quadrupole: -4.6998 6.7307 -2.0309 5.3078 -2.8224 0.4749
hfenergy: -479.1389327 hartree
pointgroup: C01 [X(C7H13N1O2)]
dipole: 0.6723827 -0.5951499 -0.12962 debye
dipolederiv: -0.2897857 0.0066522 -0.0277773 -0.0017361 -0.4435454 -0.245064 -0.0199057 -0.2032365 -1.1189921 -1.0501884 0.130292 0.2756371 0.0100965 -0.3289079 -0.1057123 0.0285182 -0.1200157 -0.6354066 -0.3085298 0.0772773 0.0374468 0.1275797 -0.8032276 -0.0780123 0.1501701 -0.0886156 -0.5099513 -0.1942528 -0.048872 -0.1513491 0.0307979 0.4047193 0.1152857 -0.2251505 0.1831862 0.4092157 0.0862147 0.0169441 0.0172939 -0.0644766 0.1132195 0.0596279 -0.0254764 0.0217835 0.1115318 0.0044011 0.0485791 0.0801811 0.0086909 0.0126295 0.0290605 0.0297282 0.04931 -0.0012724 -0.0390213 0.022665 0.006666 -0.0833679 -0.0566694 -0.0982936 0.0018736 0.0434764 0.0494922 0.006526 -0.0557206 0.0338201 0.081198 0.0619471 0.1169723 0.0360372 0.0672871 0.073644 -0.0290822 -0.0435534 0.0207519 -0.0223071 0.0557521 0.0181078 0.0385866 0.0312953 0.0766819 1.4032448 -0.1446141 -0.1292123 -0.0059511 0.2346732 0.3536331 0.0879711 0.325398 1.2747143 0.025753 -0.0388373 -0.0532104 -0.0194171 -0.0533016 -0.1051833 -0.022956 -0.0889401 -0.0857867 0.0088338 -0.0723913 -0.0340016 -0.0490768 -0.0561 -0.0566507 -0.0267147 -0.0997901 0.0302164 0.0520595 0.0507026 -0.0495845 0.0462521 0.0438654 0.0530953 -0.0463019 0.0893401 -0.0743263 0.0350481 -0.0123533 -0.0261554 -0.0368023 -0.0543575 -0.0979986 -0.0511226 -0.136216 -0.0222969 -0.0122347 -0.0416889 0.0799396 -0.0117777 0.0370341 0.0629214 0.0828922 0.099494 -0.103464 0.0159122 -0.0386045 -0.0540331 -0.0870939 0.0017693 -0.1287097 -0.0725932 -0.0664622 -0.1049205 -0.0455022 0.1284439 -0.0154905 0.1244445 -0.1051277 0.0209133 0.0128953 -0.0142033 0.0745785 0.0583056 -0.013909 0.0054412 -0.0540769 -0.0028113 -0.0972863 -0.0667579 -0.1345273 -0.0827312 -0.1134013 0.0962058 0.0348127 0.1591031 -0.0365702 -0.0234598 0.0060989 -0.0085501 0.094909 0.0635676 -0.0090888 -0.0062455 -0.0561921 -0.0066804 0.1327934 0.0437775 0.1296066 -0.0888853 0.067142 0.0177412 -0.0928269 0.0445854 0.3352941 0.0434683 -0.0793467 -0.0445625 0.1226352 0.1728521 -0.0525598 0.090628 -0.1284909 0.2801063 0.048441 0.0826682 -0.020045 0.1700883 0.0821377 -0.0233102 -0.0427318 -0.0119816 0.3662892 -0.0179494 0.0351085 -0.0150129 0.3403259 unknown
polarizability: 102.4933427|-1.2637977|73.1566753|-3.0834821|2.5487341|82.1447569 unknown
InChI: InChI=1S/C7H13NO2/c1-5-2-3-7(8,4-5)6(9)10/h5,9H,2-4,8H2,1H3
charge 0 multiplicity 1
23 atoms
O  -1.751473 -0.324462 -1.490915
O  -3.010795 0.282071 0.355669
N  -0.799815 1.135162 1.718136
C  -0.539651 0.312739 0.52358
C  1.731847 -0.029087 -0.528163
C  0.562574 0.986957 -0.376908
C  0.063442 -1.127952 0.836181
C  1.589827 -0.916166 0.735977
C  3.10993 0.635044 -0.699222
C  -1.885338 0.12431 -0.170569
H  1.527465 -0.66999 -1.410488
H  0.901817 1.893925 0.156943
H  0.160894 1.306253 -1.352166
H  -0.248676 -1.854533 0.062039
H  -0.288429 -1.489473 1.818189
H  1.970806 -0.368967 1.624032
H  2.150731 -1.865633 0.665852
H  3.343961 1.281509 0.16868
H  3.91359 -0.120103 -0.785934
H  3.143273 1.266791 -1.60627
H  -0.015228 1.177791 2.373402
H  -1.706927 0.954452 2.160403
H  -2.658622 -0.475238 -1.871347
