program: Gaussian 09
title: 000192913
version: EM64L-G09RevD.01
frameworkgroup: C1[X(C12H16F3NO)]
method: RPBEPBE
basis: SDD
operation: Freq
keyword: #p
keyword: freq=noraman
keyword: PBEPBE/SDD
title: #p freq=noraman PBEPBE/SDD
converged: YES YES NO NO
title: Mulliken charges:
elementType: F F F O N C C C C C C C C C C C C H H H H H H H H H H H H H H H H
charge: -0.165270 -0.166386 -0.167832 -0.297194 -0.278567 -0.190081 -0.401445 0.475435 -0.468549 -0.434287 0.300388 -0.323620 -0.199208 -0.386293 0.241808 -0.687878 -0.508848 0.213412 0.219135 0.210698 0.269586 0.293161 0.246175 0.182407 0.205933 0.237529 0.268234 0.229429 0.205825 0.211129 0.222094 0.207198 0.235880
chargesum: 0.00000
title: Mulliken charges with hydrogens summed into heavy atoms:
elementType: F F F O N C C C C C C C C C C C C
charge: -0.165270 -0.166386 -0.167832 -0.297194 -0.008982 0.023332 0.028389 0.475435 -0.175388 -0.188112 0.300388 0.064720 0.038321 -0.118058 0.241808 -0.041496 0.156324
polarizability: 1.81678704e+02 -4.76365603e+00 1.32782292e+02 8.51760570e+00 -1.12903091e+01 1.12721715e+02
1716.lowfreq: -13.3744 -5.2462 -0.0011 -0.0010 -0.0006 2.2960 7.2306 21.3488 47.5021
frequency: -13.0215 21.3332 47.4756 56.1916 77.9015 96.1442 104.9913 125.3691 148.3966 163.0175 183.0565 232.6146 239.5081 251.1322 255.4659 294.2554 303.1425 324.1257 365.0009 412.3248 425.6682 436.4067 485.5613 516.6699 535.7130 607.8530 624.6228 632.8679 700.5309 706.6112 727.3926 797.6296 810.9800 814.6165 880.1190 916.5131 930.6438 938.0287 984.5391 989.2601 991.2256 995.3757 1006.3166 1030.7856 1041.5579 1058.1845 1081.0398 1103.2437 1115.0460 1117.8147 1135.1446 1160.4874 1174.1920 1185.3422 1192.3861 1229.0257 1249.8674 1272.0946 1289.3957 1307.1572 1328.8691 1331.5038 1380.8907 1390.9827 1392.2145 1429.7572 1437.9260 1446.5766 1459.2843 1466.8765 1470.9426 1475.7050 1478.1284 1481.8798 1499.4064 1601.6351 1616.5433 2854.8899 2864.7186 2943.9290 2954.4184 2979.9858 2993.1586 3013.0528 3027.0823 3072.6209 3092.5771 3108.4126 3124.1742 3150.8751 3152.9596 3176.3085 3438.9752
redmass: 14.1240 4.9974 3.4119 3.6973 2.8673 1.8048 4.1828 5.7605 2.0068 3.0375 1.7707 3.9515 1.9826 1.8611 2.4011 3.9217 6.0485 8.0875 8.7741 3.7601 3.3238 6.0019 4.5712 8.6906 3.4679 11.9658 5.8905 5.3137 5.8999 2.0852 1.4357 2.1891 1.2557 1.5154 3.5713 1.8426 1.4812 1.4270 5.4739 6.0219 2.2317 1.4931 6.2339 3.7369 3.4894 3.2973 2.8222 1.8018 1.7617 1.3736 1.3506 2.9673 2.0249 1.0913 2.0042 1.4001 1.2855 1.2653 1.7210 1.7708 1.2631 1.4764 1.3673 1.4447 4.6466 1.3618 1.9841 1.2096 1.0563 1.0891 1.0599 1.2906 1.7638 1.0470 1.0883 6.3025 6.2530 1.0716 1.0706 1.0350 1.0817 1.0374 1.0862 1.0880 1.1027 1.0984 1.1003 1.0989 1.0891 1.0921 1.0920 1.0973 1.0738
irintensity: 0.0074 0.7106 0.8075 0.1061 2.6838 3.0085 1.1594 0.1698 0.9547 0.5813 0.0069 6.1592 3.0414 3.2584 1.2232 5.2288 0.4456 7.2753 4.9763 3.5087 0.8842 0.3887 2.6732 1.6194 6.5534 23.3478 12.5255 12.0410 27.6405 47.3147 38.2681 10.9616 32.0177 35.9491 31.3573 3.7134 5.9126 32.2192 168.3442 5.5162 6.9656 10.9539 164.9118 64.1559 47.6581 104.8883 34.2390 6.1872 9.1360 0.2257 18.9512 44.0493 46.1953 5.4304 93.4553 25.5380 15.6300 39.8755 84.1922 79.0418 10.8276 19.8874 3.4310 24.3145 1.1238 0.4703 46.8257 30.5107 9.7954 13.3947 19.9938 2.2219 7.4078 3.1069 5.8928 2.9960 3.3642 72.9898 130.4589 56.1045 50.2738 32.9257 34.1089 28.7590 54.9533 55.0755 38.6266 25.6628 7.0534 1.4083 9.5689 6.7241 2.4339
temp: 298.150 k
press: 1.00000 atm
elementType: 9 9 9 8 7 6 6 6 6 6 6 6 6 6 6 6 6 1 1 1 1 1 1 1 1 1 1 1 1 1 1 1 1
symmnumber: 1
zpe: 685081.1 jmol-1
zpe.correction: 0.260934 hartree
zpe.thermalcorrener: 0.278021 hartree
zpe.thermalcorrenthalpy: 0.278965 hartree
zpe.thermalcorrgfe: 0.214731 hartree
zpe.sumelectzpe: -895.055358 hartree
zpe.sumelectthermal: -895.038271 hartree
zpe.sumelectthermalent: -895.037327 hartree
zpe.sumelectthermalfe: -895.101561 hartree
dipole: 2.2591 3.1964 0.0338
dipole: 3.9143
quadrupole: -110.0335 -96.7550 -96.1400
quadrupole: -10.3150 1.4558 -1.2912
quadrupole: -9.0573 4.2212 4.8362 -10.3150 1.4558 -1.2912
hfenergy: -895.3162915 hartree
pointgroup: C01 [X(C12H16F3N1O1)]
dipole: 0.8830186 -1.1118607 0.5963504 debye
polarizability: 182.2319742|1.5399632|119.3223409|-7.7347562|-14.7766132|125.6283966 unknown
InChI: InChI=1S/C12H16F3NO/c1-3-16-8-11(17-2)9-5-4-6-10(7-9)12(13,14)15/h4-7,11,16H,3,8H2,1-2H3
charge 0 multiplicity 1
33 atoms
F  -4.565152 0.788396 0.046339
F  -2.893573 2.252454 -0.413172
F  -3.400416 0.620085 -1.893841
O  1.611924 -0.585959 -1.579204
N  3.66116 0.303613 0.166943
C  1.480916 -0.808932 -0.127218
C  2.236644 0.364679 0.526881
C  0.022115 -0.863605 0.316306
C  -0.933504 -0.012045 -0.282337
C  -0.384971 -1.731141 1.360128
C  -2.274862 -0.030191 0.164914
C  4.49911 1.367746 0.758668
C  -1.724189 -1.741408 1.807865
C  -2.6788 -0.889302 1.212029
C  -3.265548 0.881658 -0.500153
C  5.964775 1.219158 0.315409
C  1.244179 -1.755974 -2.383428
H  2.000693 -1.752972 0.148247
H  2.135615 0.285508 1.627019
H  1.731293 1.315399 0.219523
H  3.761659 0.253411 -0.857008
H  -0.621977 0.643021 -1.103366
H  0.349796 -2.401611 1.82287
H  4.135248 2.394742 0.50019
H  4.435225 1.281216 1.861996
H  -2.028043 -2.415573 2.615183
H  -3.719383 -0.893685 1.548958
H  6.355844 0.229018 0.607862
H  6.059377 1.314064 -0.78343
H  6.595729 2.000599 0.775956
H  0.175899 -2.021568 -2.254281
H  1.871689 -2.632754 -2.12087
H  1.426232 -1.472448 -3.431776
