program: Gaussian 09
title: 000192898
version: EM64L-G09RevD.01
frameworkgroup: C1[X(C13H16O3)]
method: RPBEPBE
basis: SDD
operation: Freq
keyword: #pfreq=noraman
keyword: PBEPBE/SDD
title: #p freq=noraman PBEPBE/SDD
converged: YES YES NO NO
title: Mulliken charges:
elementType: O O O C C C C C C C C C C C C C H H H H H H H H H H H H H H H H
charge: -0.270687 -0.166315 -0.148607 0.360572 -0.472378 -0.526236 0.233578 0.086035 -0.727861 -0.727606 0.265921 -0.164258 0.233197 -0.149667 -0.815083 -0.833481 0.227954 0.221089 0.267055 0.236981 0.219466 0.247135 0.231567 0.232234 0.230830 0.212901 0.245226 0.249552 0.252492 0.231143 0.231651 0.285601
chargesum: 0.00000
title: Mulliken charges with hydrogens summed into heavy atoms:
elementType: O O O C C C C C C C C C C C C C
charge: -0.270687 -0.166315 -0.148607 0.360572 -0.023335 -0.022200 0.233578 0.086035 -0.029693 -0.051641 0.265921 -0.164258 0.233197 -0.149667 -0.067813 -0.085087
polarizability: 2.00053311e+02 -1.01945044e+01 1.66632894e+02 1.64114408e+00 -7.01850153e-02 9.35724017e+01
1716.lowfreq: -10.2646 -4.2856 0.0007 0.0008 0.0009 13.7738 43.0851 66.4927 80.1532
frequency: 43.0378 66.4635 80.1404 82.1809 111.1705 149.5650 152.9393 176.0525 198.2372 214.0020 239.8740 272.5969 284.0027 317.6847 327.1045 340.0635 358.4296 377.6204 407.1281 420.6214 423.7416 454.7388 458.7742 533.4319 565.8914 588.8378 614.0130 666.1646 679.1639 730.6717 807.8029 837.9572 859.8830 875.3397 908.3068 928.4092 942.8105 985.1653 992.0634 1014.5126 1027.7758 1037.2126 1050.9505 1063.4129 1097.0157 1115.2358 1151.1775 1156.2980 1231.7155 1237.2367 1262.1776 1263.9082 1290.1537 1321.5842 1344.2617 1379.7693 1384.5347 1390.4123 1396.3527 1398.6538 1446.7513 1449.2997 1454.9803 1456.6271 1463.1195 1468.7361 1471.2371 1473.7467 1487.8390 1491.0260 1525.1747 1566.8872 1588.4709 1626.5768 2981.7757 2983.6194 2991.3651 2992.7083 2993.2611 2998.5125 3044.5603 3059.0808 3060.3086 3063.1386 3088.4648 3095.4402 3097.1679 3101.2844 3101.5936 3123.7118
redmass: 4.8743 4.4036 3.3341 1.0756 2.4707 1.2772 1.2177 1.8564 3.4745 1.3896 1.8787 3.2228 2.9817 3.1887 2.8728 3.2379 5.8658 3.7059 3.6308 4.1878 3.9987 4.1654 4.2681 3.1984 5.6289 5.0680 5.8089 5.2069 4.2927 2.5839 3.6027 4.6969 2.3296 3.8277 2.1483 1.6871 1.9272 1.4421 2.4206 1.4312 1.8179 1.7758 1.6339 2.1075 2.5387 1.7935 1.7124 3.9383 1.6049 2.2062 2.5203 5.7773 2.8721 2.8715 1.6295 1.3482 2.9899 1.2514 1.2146 1.2085 1.0704 1.1059 1.0731 1.0554 1.0755 1.0669 1.0687 1.0635 1.0608 1.0470 11.7758 12.0384 7.9250 7.2391 1.0378 1.0668 1.0359 1.0388 1.0418 1.0549 1.0934 1.0976 1.1026 1.0953 1.0993 1.0992 1.1005 1.1000 1.0977 1.0980
irintensity: 0.5707 0.4410 4.7199 0.4333 0.2062 0.4809 0.8800 1.5198 0.5136 0.0564 0.6934 4.5722 2.0069 1.0384 0.0548 1.0319 1.9842 6.2890 3.2289 2.4034 3.6510 4.7754 1.7541 2.2992 4.5470 7.3319 5.2270 8.9393 10.1116 0.7857 8.8808 0.6124 3.2591 25.4982 8.2782 4.9082 11.0769 1.7403 1.3101 4.2359 12.4776 35.5126 0.1348 9.9010 145.9430 49.0724 31.3810 108.0827 9.8033 7.5514 6.7510 16.7688 5.4474 97.3632 21.2249 52.9009 54.8427 25.0862 20.1462 37.8863 0.6882 6.0291 3.6947 25.6724 9.5091 15.7304 16.4030 40.2559 10.1728 7.7056 293.0455 30.2400 35.4274 9.0709 23.5177 14.9764 17.1496 6.6651 11.8309 35.1865 9.4931 18.6487 26.7071 7.1097 5.7387 37.8123 17.9305 29.8435 3.6781 16.9947
temp: 298.150 k
press: 1.00000 atm
elementType: 8 8 8 6 6 6 6 6 6 6 6 6 6 6 6 6 1 1 1 1 1 1 1 1 1 1 1 1 1 1 1 1
symmnumber: 1
zpe: 680871.9 jmol-1
zpe.correction: 0.259330 hartree
zpe.thermalcorrener: 0.275671 hartree
zpe.thermalcorrenthalpy: 0.276615 hartree
zpe.thermalcorrgfe: 0.216223 hartree
zpe.sumelectzpe: -729.444984 hartree
zpe.sumelectthermal: -729.428643 hartree
zpe.sumelectthermalent: -729.427699 hartree
zpe.sumelectthermalfe: -729.488091 hartree
dipole: -6.2310 4.7805 -0.0058
dipole: 7.8536
quadrupole: -97.3690 -102.1434 -92.5968
quadrupole: 16.7630 -1.1632 0.5674
quadrupole: 0.0007 -4.7736 4.7729 16.7630 -1.1632 0.5674
hfenergy: -729.7043139 hartree
pointgroup: C01 [X(C13H16O3)]
dipole: 2.5047141 1.8092322 0.0149406 debye
polarizability: 200.6388196|9.2242046|165.9741282|-0.4334989|2.5972104|93.6456586 unknown
InChI: InChI=1S/C13H16O3/c1-7-8(2)12-9(11(15)10(7)14)5-6-13(3,4)16-12/h5-6H2,1-4H3
charge 0 multiplicity 1
32 atoms
O  1.539428 1.009369 0.102957
O  -1.482394 -2.757417 -0.056451
O  -3.614057 -0.931422 -0.1054
C  2.772908 0.142292 -0.126009
C  2.554822 -1.221892 0.567269
C  1.285872 -1.933908 0.055469
C  0.114415 -0.974307 0.020194
C  0.291545 0.400785 0.075137
C  2.949523 0.023696 -1.65279
C  3.903713 0.949873 0.52228
C  -0.817554 1.388208 0.121419
C  -1.241649 -1.508321 -0.02482
C  -2.131798 0.961786 0.07004
C  -2.428024 -0.496671 -0.027146
C  -0.433404 2.847829 0.211714
C  -3.320581 1.901876 0.096125
H  2.472969 -1.049119 1.657416
H  3.44834 -1.851098 0.399602
H  1.026188 -2.789332 0.704864
H  1.454163 -2.371788 -0.948303
H  3.836045 -0.594662 -1.883066
H  2.070704 -0.442604 -2.128866
H  3.09595 1.02205 -2.099409
H  3.963767 1.958922 0.079496
H  3.737683 1.054811 1.608278
H  4.871182 0.44095 0.363132
H  -1.317019 3.498382 0.284367
H  0.159909 3.151493 -0.670436
H  0.216344 3.027164 1.087569
H  -3.297984 2.614768 -0.748783
H  -3.3514 2.494684 1.029177
H  -4.250908 1.316003 0.02857
