program: Gaussian 09
title: 000192949
version: EM64L-G09RevD.01
frameworkgroup: C1[X(C21H32O2)]
method: RPBEPBE
basis: SDD
operation: Freq
keyword: #pfreq=noraman
keyword: PBEPBE/SDD
title: #p freq=noraman PBEPBE/SDD
converged: YES YES NO NO
title: Mulliken charges:
elementType: O O C C C C C C C C C C C C C C C C C C C C C H H H H H H H H H H H H H H H H H H H H H H H H H H H H H H H H
charge: -0.463783 -0.237423 0.383206 -0.096904 -0.157103 -0.108110 0.271526 -0.632868 -0.079753 -0.560380 -0.525014 -0.253292 -0.484859 -0.840400 -0.511995 -0.643454 0.541145 -0.767507 -0.466097 -0.544232 -0.581625 -0.695125 0.177336 0.252338 0.223010 0.214656 0.198624 0.212743 0.216621 0.215756 0.225048 0.218904 0.239591 0.252812 0.224633 0.222224 0.217466 0.219430 0.237376 0.228001 0.200774 0.216649 0.236916 0.221627 0.219587 0.215544 0.217621 0.216553 0.325309 0.243574 0.223512 0.257898 0.223536 0.227833 0.210547
chargesum: 0.00000
title: Mulliken charges with hydrogens summed into heavy atoms:
elementType: O O C C C C C C C C C C C C C C C C C C C C C
charge: -0.138474 -0.237423 0.383206 0.155434 0.065906 0.106545 0.271526 -0.221501 0.136867 -0.119576 -0.066518 -0.000480 -0.038002 -0.166129 -0.083220 -0.189889 0.541145 -0.110749 -0.031923 -0.077146 -0.323727 -0.033210 0.177336
polarizability: 2.98668490e+02 -2.65236020e+00 2.07024043e+02 -1.42078540e+01 1.81709729e+00 1.73298704e+02
1716.lowfreq: -17.9273 -8.7731 -4.4786 -0.0006 0.0003 0.0005 28.9010 60.5011 70.1475
frequency: 28.8376 60.4255 70.0779 89.8872 106.1943 126.4059 140.2194 150.1576 161.5339 178.2972 190.1241 199.5333 204.2426 220.5859 237.4606 241.1355 273.2908 296.5090 298.5867 314.6482 315.8416 332.0251 354.7257 357.8436 366.7485 385.5748 402.1407 413.1068 434.5639 459.7512 470.6800 486.8487 501.6017 515.9020 541.1113 552.5990 580.1257 612.3011 623.1749 648.5849 692.0703 726.2445 756.4093 779.3614 783.4988 789.6308 815.8624 818.8318 855.7703 865.4084 886.1113 888.7522 906.9823 909.9669 927.3996 943.8504 961.2863 967.1733 974.6342 987.7271 998.0580 999.3913 1019.5390 1023.4299 1027.1259 1048.3944 1059.3914 1065.4824 1076.3692 1084.8914 1094.9208 1097.2373 1104.5932 1111.0108 1134.0122 1144.8922 1146.8694 1154.0548 1166.6636 1183.1156 1189.6260 1204.4036 1209.4240 1215.7944 1219.4826 1222.8819 1248.7674 1251.3152 1260.3302 1268.0362 1272.5875 1283.6324 1286.8700 1288.4807 1296.8343 1303.3918 1319.2767 1323.2251 1329.6807 1330.3690 1336.2220 1340.1919 1344.9646 1348.1789 1351.5324 1356.5499 1363.9851 1372.9107 1390.0064 1391.0361 1398.0126 1441.0129 1452.9620 1455.6119 1456.9413 1461.3637 1466.2341 1468.7305 1469.6778 1472.5420 1476.2881 1485.9559 1490.3855 1493.0096 1506.4781 1585.3573 1625.8222 2911.0722 2925.2541 2940.7523 2942.4930 2944.6253 2948.5379 2959.0245 2968.5356 2969.6832 2973.2289 2978.6557 2982.3596 2984.2309 2987.2726 2990.3664 3006.5410 3014.8544 3032.6971 3037.1535 3040.3013 3043.6351 3051.0712 3062.9568 3063.3736 3072.5265 3074.5743 3081.3837 3084.3263 3088.4265 3098.0752 3121.1552 3541.3589
redmass: 5.6959 3.2301 4.0720 3.1278 2.0580 3.0438 2.0442 3.6838 2.0588 1.9825 1.2758 3.0537 2.2282 2.3563 2.3568 2.6256 2.6847 1.5191 1.5222 2.2108 2.3348 2.1839 2.6706 2.1833 2.9033 2.6976 2.7920 2.8991 3.3990 3.5344 2.7802 3.4107 3.8743 2.6596 3.0987 2.6089 2.7546 3.5662 3.2220 3.3726 3.0224 2.9578 2.2802 2.5121 1.3756 1.7293 2.2849 1.9853 2.5214 2.1222 2.0809 1.8875 1.6359 1.8233 2.0330 1.7320 1.8033 2.5273 2.1750 1.9726 2.5465 1.8562 2.0560 2.6524 1.7141 2.1279 2.0090 1.8731 1.7707 2.1658 2.1185 1.5935 1.8417 1.8136 1.7562 2.1213 2.0215 1.8240 2.1198 1.7459 1.8362 1.6446 1.7143 1.5143 1.3337 1.5316 1.4516 1.3968 1.5257 1.5977 1.4887 1.3184 1.3756 1.4988 1.3949 1.3230 1.4732 1.3867 1.4683 1.4675 1.4641 1.6717 1.4658 1.8551 1.6346 1.5479 1.3494 1.4048 1.2056 1.2150 1.1931 1.0826 1.0906 1.0791 1.0821 1.0747 1.0783 1.0875 1.0445 1.0650 1.0608 1.0682 1.0582 1.0618 1.0521 9.9044 7.6726 1.0782 1.0816 1.0765 1.0685 1.0638 1.0659 1.0818 1.0676 1.0762 1.0636 1.0638 1.0383 1.0361 1.0594 1.0418 1.1007 1.0636 1.0914 1.0934 1.1004 1.0987 1.0999 1.0976 1.0959 1.0990 1.0996 1.0988 1.1019 1.0997 1.0950 1.0914 1.0655
irintensity: 2.0191 0.2450 2.4365 0.4391 0.8074 0.9510 0.6708 0.9311 0.1138 0.9479 0.1624 0.9121 1.6640 2.2627 0.5443 4.7047 10.8556 1.0182 96.6269 29.0274 36.3183 9.0903 2.8252 0.8271 11.6968 3.9003 5.1132 14.0931 6.5324 4.4774 2.1252 2.1165 2.4343 1.3861 4.1690 1.1831 1.0167 1.3147 1.9376 3.7037 6.7258 3.3385 5.5993 2.4442 1.1697 4.6745 1.7081 2.6359 5.9741 0.8720 16.6354 8.0725 28.3536 9.9784 13.5494 14.3105 3.2831 19.2187 15.6835 7.8817 4.0547 1.0963 0.7512 1.2708 0.4105 0.6178 1.7578 1.7827 2.8566 17.9970 2.7619 14.4625 17.5901 13.1701 11.4130 6.6117 5.3422 1.1488 0.5488 11.4493 1.5209 21.5064 13.4609 0.4813 0.3918 8.1390 4.8947 24.3914 3.0605 52.3971 1.2298 3.1719 3.7972 3.2310 1.7589 0.3555 10.5486 3.1462 1.7386 6.6446 2.1667 8.8140 1.6939 12.1047 2.0174 6.4346 1.8751 3.1948 15.7352 1.6350 46.9976 13.6435 14.6835 5.2805 3.8586 3.4443 3.4882 7.1532 13.3691 3.3295 16.5653 8.4043 14.8687 3.8123 8.5770 173.1570 211.8014 0.6236 10.1897 4.2792 34.2048 13.2442 35.7214 16.1780 9.8835 41.6806 33.4480 59.2673 27.4639 39.3728 34.2762 30.8574 35.2705 42.0184 16.3597 44.2649 35.9035 38.8908 24.3529 67.1691 15.1566 17.6122 54.2829 33.4464 14.6861 47.3688 41.0720 10.4105 3.7050
temp: 298.150 k
press: 1.00000 atm
elementType: 8 8 6 6 6 6 6 6 6 6 6 6 6 6 6 6 6 6 6 6 6 6 6 1 1 1 1 1 1 1 1 1 1 1 1 1 1 1 1 1 1 1 1 1 1 1 1 1 1 1 1 1 1 1 1
symmnumber: 1
zpe: 1273823.7 jmol-1
zpe.correction: 0.485174 hartree
zpe.thermalcorrener: 0.507593 hartree
zpe.thermalcorrenthalpy: 0.508537 hartree
zpe.thermalcorrgfe: 0.436154 hartree
zpe.sumelectzpe: -968.084150 hartree
zpe.sumelectthermal: -968.061731 hartree
zpe.sumelectthermalent: -968.060787 hartree
zpe.sumelectthermalfe: -968.133170 hartree
dipole: -5.3255 -1.5465 2.7880
dipole: 6.2068
quadrupole: -184.9946 -133.8432 -143.6598
quadrupole: 1.4035 7.8216 4.4703
quadrupole: -30.8287 20.3226 10.5061 1.4035 7.8216 4.4703
hfenergy: -968.5693243 hartree
pointgroup: C01 [X(C21H32O2)]
dipole: 2.1057207 0.5992838 1.0816535 debye
polarizability: 298.7844403|-3.2433778|207.0451824|13.493931|-2.0804777|173.161614 unknown
InChI: InChI=1S/C21H32O2/c1-4-21(23)10-9-18-17-7-5-14-11-15(22)6-8-16(14)19(17)13(2)12-20(18,21)3/h11,13,16-19,23H,4-10,12H2,1-3H3
charge 0 multiplicity 1
55 atoms
O  3.421125 -0.02066 -1.935369
O  -6.268741 -0.018325 -1.031323
C  2.27107 0.3534 0.278858
C  1.428146 -0.923276 -0.022394
C  0.003557 -0.878203 0.564896
C  -0.742657 0.342434 -0.065153
C  3.622891 -0.036553 -0.454842
C  1.520626 1.576137 -0.302879
C  0.022871 1.698412 0.139865
C  2.386524 -2.084748 0.336845
C  3.792242 -1.551206 -0.104942
C  -2.24812 0.444236 0.368766
C  -0.767136 -2.184013 0.269437
C  2.567418 0.52446 1.796535
C  4.840285 0.855778 -0.119582
C  -2.218216 -2.112468 0.797604
C  -2.966148 -0.902372 0.274325
C  -0.16583 2.314835 1.552376
C  -2.986872 1.535556 -0.451472
C  -4.515944 1.508968 -0.251438
C  -4.245892 -1.022463 -0.207898
C  6.141535 0.434982 -0.838087
C  -5.098907 0.129545 -0.559787
H  1.312854 -0.946808 -1.128293
H  0.047294 -0.757417 1.669602
H  -0.747857 0.148475 -1.16322
H  1.518966 1.479732 -1.408786
H  2.040617 2.524361 -0.054283
H  -0.423104 2.426378 -0.569436
H  2.125626 -3.023663 -0.181933
H  2.364498 -2.293848 1.424135
H  4.547961 -1.688905 0.689182
H  4.16029 -2.07184 -1.004777
H  -2.264674 0.73328 1.444982
H  -0.247911 -3.043337 0.734151
H  -0.776451 -2.363952 -0.825178
H  2.984701 1.526206 2.005859
H  1.657881 0.41526 2.407693
H  3.292883 -0.223961 2.161645
H  5.012497 0.852025 0.972372
H  4.596159 1.906489 -0.390781
H  -2.175552 -2.041621 1.907114
H  -2.774901 -3.037502 0.560132
H  -1.184338 2.72777 1.674669
H  -0.007054 1.590148 2.36905
H  0.543598 3.148883 1.706142
H  -2.760672 1.377645 -1.525806
H  -2.60104 2.536842 -0.186663
H  3.393003 0.925037 -2.233131
H  -5.026642 2.259633 -0.879906
H  -4.764014 1.7483 0.804361
H  -4.717355 -2.010119 -0.295496
H  6.471776 -0.569322 -0.515665
H  5.997671 0.400926 -1.932095
H  6.958759 1.14515 -0.615083
