program: Gaussian 09
title: 000192878
version: EM64L-G09RevD.01
frameworkgroup: C1[X(C7H11NO4)]
method: RPBEPBE
basis: SDD
operation: Freq
keyword: #p
keyword: freq=noraman
keyword: PBEPBE/SDD
title: #p freq=noraman PBEPBE/SDD
converged: NO YES NO NO
title: Mulliken charges:
elementType: O O O O N C C C C C C C H H H H H H H H H H H
charge: -0.448731 -0.208734 -0.270070 -0.185744 -0.401046 -0.139752 -0.388876 -0.436986 0.130975 0.234209 -0.061661 -0.785348 0.307506 0.252368 0.278462 0.241581 0.238478 0.346933 0.169723 0.266150 0.233124 0.234612 0.392826
chargesum: 0.00000
title: Mulliken charges with hydrogens summed into heavy atoms:
elementType: O O O O N C C C C C C C
charge: -0.055905 -0.208734 -0.270070 -0.185744 -0.054112 0.167754 0.141954 0.043074 0.130975 0.234209 0.108062 -0.051462
polarizability: 9.57476780e+01 -5.08570596e+00 9.44941385e+01 7.39017717e+00 7.50212176e+00 8.67937739e+01
1716.lowfreq: -93.7267 -3.8171 0.0006 0.0009 0.0012 4.7857 11.9682 31.5665 42.5009
frequency: -93.7220 31.5394 42.4947 51.8555 79.3832 94.1091 126.8063 164.8603 178.0333 199.1170 241.6308 313.9005 348.5642 447.3355 516.6102 527.4858 572.6606 602.3987 615.4815 628.2224 664.6346 672.7226 740.6723 795.9864 847.8175 895.9966 940.1752 948.4752 982.2024 1033.2421 1034.5468 1079.8562 1099.8167 1139.9336 1182.2012 1224.2392 1238.2903 1273.0612 1289.6962 1303.8622 1328.9246 1360.0977 1377.1804 1381.3021 1427.0635 1442.4733 1464.9589 1466.7790 1475.5384 1619.6650 1645.6198 1674.6879 2853.4756 2951.2386 2989.7481 2994.1929 3001.7091 3032.4396 3075.0856 3097.0245 3134.7148 3525.0802 3548.1124
redmass: 1.0382 7.6325 8.5118 4.9895 3.6741 4.2252 4.6672 1.7819 5.5806 3.7911 4.6303 4.0035 4.4029 3.6550 4.0593 3.0192 1.9007 1.5571 2.4214 2.4840 1.9734 1.4706 4.6381 3.0877 1.7572 2.7547 3.7245 2.3940 1.8114 1.9323 1.6841 2.3970 2.1500 3.3280 1.3805 1.3531 1.6331 1.2622 1.7004 1.6474 1.6448 1.4083 1.2528 1.2616 1.1203 1.2549 1.0878 1.0500 1.6305 6.4265 7.4755 9.1716 1.0842 1.0611 1.0381 1.0968 1.0813 1.0617 1.0982 1.1032 1.0983 1.0644 1.0782
irintensity: 0.0330 2.6917 6.4612 1.7097 8.0448 0.3874 4.7747 2.0823 20.7074 2.9965 1.2456 0.4012 2.1420 9.3488 31.5164 73.9974 26.5208 75.2703 12.6411 89.6228 47.3877 25.0038 9.1399 9.8881 9.3596 4.5209 16.7277 35.4827 27.5474 109.6225 11.8295 50.7222 45.8784 18.2592 9.1678 7.6973 33.9307 3.6186 22.7457 50.7606 14.7476 6.1617 47.6677 3.9821 28.6075 162.4833 25.7526 17.2999 205.1843 141.4798 132.1324 213.1728 145.5275 32.8754 8.8004 10.3429 12.8259 7.9176 15.8328 6.1921 7.5807 32.8482 52.4384
temp: 298.150 k
press: 1.00000 atm
elementType: 8 8 8 8 7 6 6 6 6 6 6 6 1 1 1 1 1 1 1 1 1 1 1
symmnumber: 1
zpe: 466765.1 jmol-1
zpe.correction: 0.177781 hartree
zpe.thermalcorrener: 0.190702 hartree
zpe.thermalcorrenthalpy: 0.191647 hartree
zpe.thermalcorrgfe: 0.136276 hartree
zpe.sumelectzpe: -628.062587 hartree
zpe.sumelectthermal: -628.049666 hartree
zpe.sumelectthermalent: -628.048722 hartree
zpe.sumelectthermalfe: -628.104092 hartree
dipole: 2.2190 3.1373 5.9765
dipole: 7.1053
quadrupole: -75.8818 -75.8259 -70.7551
quadrupole: -1.3011 -0.7195 -1.4569
quadrupole: -1.7276 -1.6716 3.3992 -1.3011 -0.7195 -1.4569
hfenergy: -628.2403685 hartree
pointgroup: C01 [X(C7H11N1O4)]
dipole: -0.7842464 -1.1700835 2.4146096 debye
dipolederiv: -0.5457527 -0.1275657 0.2461208 -0.1807348 -0.4536199 0.2547273 0.3274403 0.2067749 -0.9779003 -0.5393041 0.2051036 0.2515649 0.2667034 -0.8051435 -0.2242143 0.169411 -0.0150597 -0.5990518 -0.5417968 0.1088302 0.1027777 0.2518392 -0.6277896 0.1424087 -0.1216732 0.3173768 -0.8178888 -0.5583788 -0.1968093 0.0538063 -0.2519299 -0.4829114 0.13109 0.1522706 0.1966501 -0.5906233 -0.9690097 0.3494922 -0.0865829 0.4120152 -0.8880349 0.0686442 -0.1323489 0.1117353 -0.4328508 0.4646321 -0.1284845 -0.0521007 -0.0618513 0.0020658 0.101386 -0.2141016 0.3241227 0.1520235 0.0326575 0.1400566 0.0050235 0.0370201 0.0074606 0.0459335 0.0344777 -0.0204203 0.0460362 -0.3224539 -0.3313205 0.0133817 -0.3641157 -0.0834061 0.0512427 0.1332525 0.1168417 -0.0286184 0.5695596 -0.2430646 -0.514836 -0.1756667 1.2188994 -0.0821466 -0.5068277 -0.2504134 1.1650852 0.9377183 -0.5956676 -0.1359823 -0.8062216 0.9821763 -0.2961407 0.0559263 -0.4213434 0.9631691 0.8164084 0.4914653 0.0305076 0.5334883 0.4746527 -0.2077801 0.0304595 -0.2082557 0.7934938 -0.1810936 0.1522276 0.1680555 0.1319219 -0.0316915 -0.0488156 0.2468292 -0.1002331 -0.1917459 0.0281859 -0.0161206 -0.0460462 -0.0152645 0.0763882 0.0007592 0.0107236 -0.1094379 0.0070846 -0.0185428 0.0523438 0.0565381 0.0417249 0.0711415 -0.0728584 0.0303433 -0.0690566 -0.0022755 0.1044511 -0.0135714 -0.0290633 0.0180105 -0.0335304 0.0393585 -0.0488399 0.0235752 0.0634273 0.0797236 0.0237132 0.1010743 0.0381609 0.0607858 -0.061649 0.0223537 -0.0903503 -0.0182963 0.0441434 0.0446168 -0.0367704 0.0574187 -0.0570155 0.0863248 -0.0821849 0.0255364 0.0565974 0.255447 0.0416632 0.0426803 0.0431669 0.3034784 0.0375853 0.0874109 0.0018991 0.1805345 -0.0944354 -0.0786714 -0.1382574 -0.0629385 0.0453615 0.0089568 -0.1934717 -0.0259552 -0.2325239 0.0519907 0.0747718 -0.0069528 0.0976375 0.0162694 0.038569 -0.0497363 0.0756959 0.0744411 0.0219114 -0.0541588 0.0578164 -0.115226 -0.0397272 0.0476895 0.0520164 0.0220853 0.0867918 0.0260815 -0.0395501 -0.1007096 -0.0023812 0.0906261 -0.055774 -0.0510375 -0.069213 -0.0443021 0.3378574 0.1407002 0.0179544 0.1072227 0.1535644 -0.0052969 0.0473067 -0.0425546 0.3473926 unknown
polarizability: 94.8353667|-5.6020002|94.3945624|-7.7943477|-7.2545944|87.8056614 unknown
InChI: InChI=1S/C7H11NO4/c1-5(10)8-6(7(11)12)3-2-4-9/h4,6,8,11H,2-3H2,1H3
charge 0 multiplicity 1
23 atoms
O  -0.586991 -2.390944 1.114122
O  0.704949 -2.814926 -0.770499
O  -1.951135 1.58743 -1.190201
O  3.360349 1.886329 -0.397548
N  -1.301757 0.024902 0.395713
C  -0.319516 -0.586684 -0.510505
C  1.00395 0.231815 -0.630347
C  1.755401 0.375663 0.702181
C  -0.008275 -2.02707 -0.118835
C  -2.090022 1.085358 -0.033378
C  2.976679 1.277119 0.628647
C  -3.116015 1.580278 0.983317
H  -0.758258 -0.609317 -1.528083
H  1.649309 -0.257601 -1.381005
H  0.736941 1.225112 -1.028568
H  1.089569 0.788162 1.491439
H  2.101803 -0.606489 1.091642
H  -1.485581 -0.439026 1.287477
H  3.544232 1.367267 1.592853
H  -3.703294 2.390402 0.527527
H  -3.802224 0.768898 1.288923
H  -2.619847 1.968147 1.892032
H  -0.352566 -3.334219 1.326797
