program: Gaussian 09
title: 000192876
version: EM64L-G09RevD.01
frameworkgroup: C1[X(C6H12O4)]
method: RPBEPBE
basis: SDD
operation: Freq
keyword: #pfreq=noraman
keyword: PBEPBE/SDD
title: #p freq=noraman PBEPBE/SDD
converged: YES YES NO NO
title: Mulliken charges:
elementType: O O O O C C C C C C H H H H H H H H H H H H
charge: -0.264804 -0.484109 -0.452303 -0.462039 -0.111150 -0.067400 -0.044824 -0.415635 -0.321801 -0.409082 0.214472 0.192666 0.204199 0.221151 0.233011 0.227694 0.188769 0.231963 0.241253 0.360729 0.358397 0.358847
chargesum: 0.00000
title: Mulliken charges with hydrogens summed into heavy atoms:
elementType: O O O O C C C C C C
charge: -0.264804 -0.123380 -0.093906 -0.103193 0.103322 0.125265 0.159375 0.038526 0.094661 0.064133
polarizability: 8.61593724e+01 -3.37493178e+00 7.94250402e+01 2.06899415e+00 -4.21007999e-01 6.22248745e+01
1716.lowfreq: -4.7216 -2.0753 -0.0006 0.0005 0.0006 19.2047 81.6906 115.0929 161.4708
frequency: 81.6671 115.0895 161.4658 195.2480 246.5575 253.7760 286.0496 332.1357 342.1699 384.0433 414.4382 465.5673 484.3854 492.9010 509.0334 592.0815 640.9448 827.9932 870.0848 882.4073 920.0467 949.1202 965.6888 1007.0465 1019.3593 1053.4677 1058.6283 1074.5488 1100.5142 1125.5695 1151.0482 1180.9974 1216.9376 1252.6381 1263.2929 1272.6321 1295.3550 1315.6936 1317.6933 1329.5091 1346.2325 1360.1406 1365.8607 1396.7387 1410.1658 1457.8608 1463.2509 1470.3390 2910.5922 2927.4111 2944.8410 2964.5041 3010.0190 3014.9328 3074.3073 3089.4715 3102.9411 3396.5192 3531.3098 3583.3049
redmass: 5.9291 3.2802 3.1980 4.6692 2.6722 2.9520 1.2130 4.6028 2.8737 5.1547 4.4977 1.7408 1.6322 2.8076 4.4621 2.8197 1.1034 2.8554 2.0128 1.8817 2.2477 5.6545 2.9826 3.1133 4.4522 2.2169 3.1337 1.8154 2.1713 2.0911 1.6556 1.4076 1.1999 1.1806 1.2664 1.1763 1.2001 1.3151 1.2301 1.2546 1.2136 1.2584 1.4140 1.7110 1.5694 1.0963 1.0944 1.0831 1.0821 1.0812 1.0696 1.0856 1.0603 1.0624 1.1016 1.0966 1.1042 1.0659 1.0651 1.0665
irintensity: 2.2312 4.3072 7.6441 20.2382 2.0110 21.1246 194.8452 0.6929 5.6401 3.7655 12.1671 49.9245 107.1928 13.1064 28.5759 16.4653 135.1613 10.3169 6.9853 7.3820 8.4388 63.7430 7.0480 9.5793 158.7267 25.9356 79.1366 28.4048 7.0656 5.6125 8.3265 15.1563 27.8841 18.7057 7.3402 0.5014 7.1535 15.6570 3.3427 80.0848 6.5988 9.1262 5.7622 17.6270 16.3468 11.9839 5.5702 8.6226 24.3184 28.0704 76.4681 89.9704 23.2298 38.4413 33.1379 33.4766 22.6320 143.0798 13.8791 14.6511
temp: 298.150 k
press: 1.00000 atm
elementType: 8 8 8 8 6 6 6 6 6 6 1 1 1 1 1 1 1 1 1 1 1 1
symmnumber: 1
zpe: 480112.7 jmol-1
zpe.correction: 0.182865 hartree
zpe.thermalcorrener: 0.193110 hartree
zpe.thermalcorrenthalpy: 0.194054 hartree
zpe.thermalcorrgfe: 0.147863 hartree
zpe.sumelectzpe: -535.873354 hartree
zpe.sumelectthermal: -535.863110 hartree
zpe.sumelectthermalent: -535.862165 hartree
zpe.sumelectthermalfe: -535.908356 hartree
dipole: 1.9893 1.9771 1.9914
dipole: 3.4398
quadrupole: -59.8602 -64.5745 -58.1237
quadrupole: -4.0495 2.9508 0.8951
quadrupole: 0.9926 -3.7217 2.7291 -4.0495 2.9508 0.8951
hfenergy: -536.0562192 hartree
pointgroup: C01 [X(C6H12O4)]
dipole: 1.0549471 0.4384529 0.7254662 debye
dipolederiv: -0.7264264 0.1931278 -0.0005414 0.2508346 -0.8047036 -0.0485371 0.0003511 -0.0513701 -0.3810335 -0.5256684 0.0366426 -0.1170471 0.0927442 -0.8886656 0.0271147 -0.1161789 0.0557607 -0.486925 -0.7597936 -0.2837495 0.0560793 -0.2917132 -0.4638537 -0.1197608 0.0576357 -0.1325644 -0.5011422 -0.7735484 0.19171 0.103259 0.1794797 -0.7055672 0.1395321 0.15274 0.1436918 -0.2423686 0.04729 -0.1615056 0.076417 -0.0433117 0.4782421 -0.0951891 0.0868234 -0.0742281 0.3064616 0.48377 0.2409971 0.0272121 0.185641 0.4128005 0.0878999 -0.0228793 0.0487816 0.400091 0.189237 -0.0407595 0.0651222 -0.0943412 0.4781892 0.0057197 0.1729941 -0.0855612 0.3144767 -0.0853203 -0.0139165 -0.0260352 -0.1245132 -0.1008174 0.0072971 -0.0063732 -0.0180495 0.0827159 0.6073964 -0.2283498 -0.0387905 -0.0992041 0.3894492 0.068787 -0.0605461 0.1793826 0.3909232 0.363478 -0.1205801 0.0081185 -0.1335604 0.5169988 -0.1057325 -0.0225154 -0.1209941 0.2925968 0.0275948 -0.0020838 0.0016873 0.006672 -0.0206064 0.0210181 -0.0062323 0.0337429 -0.1918705 -0.0248251 -0.0222378 -0.0622829 -0.0184978 0.0018079 -0.0027455 -0.0465406 -0.0322171 -0.2216955 0.0126127 0.0023723 0.0119428 0.0199066 -0.0242733 -0.0029995 -0.0633222 0.0406123 -0.2184044 -0.0833551 0.1155127 0.0615534 0.0791869 0.0306929 -0.0354015 0.0786979 -0.0469253 0.0608912 0.0869173 -0.0182966 -0.0049322 -0.0277428 0.0592673 -0.0204905 -0.0451508 0.0234184 -0.1265569 0.0350024 0.0130086 0.0118959 0.018986 -0.1498646 0.0435249 0.0114158 0.0875053 0.064729 -0.0319535 0.0411652 -0.0231052 0.015438 0.0608339 0.0227844 0.0141736 -0.1109517 -0.2163881 -0.1134122 -0.0766701 -0.0315075 -0.0952421 -0.0536455 0.0032815 -0.0583838 -0.0306772 0.0744884 0.0927666 0.0208029 -0.0494712 0.0243232 0.0462053 -0.0073478 0.0031526 0.0195827 -0.0998819 0.4295063 0.0723464 0.0590639 0.0535196 0.3522182 0.0227215 0.0527593 0.034766 0.2890798 0.3678142 0.1002874 -0.063287 0.0712089 0.1244085 0.051407 -0.0699026 0.061665 0.3217106 0.3809172 -0.0598237 -0.0653513 -0.0698141 0.2608836 -0.0628836 -0.1127182 -0.0253709 0.0881024 unknown
polarizability: 82.8606896|-4.7836433|82.7516634|1.0159927|-1.6408096|62.1969342 unknown
InChI: InChI=1S/C6H12O4/c7-3-5-6(9)4(8)1-2-10-5/h4-9H,1-3H2
charge 0 multiplicity 1
22 atoms
O  0.800996 1.521352 -0.379428
O  -0.185903 -2.077678 0.251265
O  -2.719781 -0.8623 -0.228002
O  2.547423 -1.764844 -0.158307
C  -0.258141 -0.72237 -0.309054
C  -1.555695 -0.102956 0.230603
C  0.962289 0.139743 0.101764
C  -1.690424 1.346338 -0.253101
C  -0.434734 2.144708 0.145992
C  2.272509 -0.355467 -0.536917
H  -0.310035 -0.757646 -1.419914
H  -1.497016 -0.129665 1.34353
H  1.044768 0.125635 1.21544
H  -2.59149 1.807767 0.191858
H  -1.815312 1.352934 -1.351251
H  -0.441365 3.158108 -0.286124
H  -0.358914 2.224684 1.253149
H  3.113105 0.306021 -0.255773
H  2.176586 -0.363295 -1.634477
H  0.72456 -2.431391 0.036223
H  -2.519944 -1.820217 -0.056067
H  2.973116 -1.789861 0.734592
